program: Gaussian 09
title: 000244543
version: EM64L-G09RevD.01
frameworkgroup: C1[X(C10H8N2O3)]
method: RPBEPBE
basis: SDD
operation: Freq
keyword: #p
keyword: freq=noraman
keyword: PBEPBE/SDD
title: #p freq=noraman PBEPBE/SDD
converged: NO YES NO NO
title: Mulliken charges:
elementType: O O O N N C C C C C C C C C C H H H H H H H H
charge: -0.203399 -0.243766 -0.176967 -0.019488 0.015641 0.322407 0.140357 -0.071515 0.207020 -0.348188 -0.319467 -0.278470 -0.181844 -0.362942 -0.538957 0.271474 0.257593 0.322531 0.234686 0.247367 0.265290 0.230313 0.230323
chargesum: 0.00000
title: Mulliken charges with hydrogens summed into heavy atoms:
elementType: O O O N N C C C C C C C C C C
charge: -0.203399 -0.243766 -0.176967 -0.019488 0.015641 0.322407 0.140357 -0.071515 0.207020 -0.076714 -0.061874 0.044062 0.052842 -0.115575 0.186969
polarizability: 2.20105184e+02 9.60678549e+00 1.56682996e+02 3.72906210e-02 6.62939908e-03 5.56920176e+01
1716.lowfreq: -79.9645 -7.3240 -6.6770 -0.0005 0.0007 0.0008 10.4615 47.7315 84.3747
frequency: -79.9638 47.6827 84.3390 121.4411 197.0897 211.7807 246.3674 263.7930 311.2573 339.0534 347.2922 366.1993 408.6031 425.8126 502.2004 538.7492 540.3576 599.7757 628.1200 644.3442 709.0670 709.0994 741.2871 771.0549 819.7164 832.2263 848.3005 875.6186 950.8220 959.1646 977.9832 1011.0061 1029.7133 1053.5111 1097.7799 1126.0736 1134.8712 1159.2908 1175.8134 1217.7218 1240.4830 1260.7006 1308.1192 1347.1701 1348.8371 1371.4887 1412.9157 1425.7825 1447.5228 1465.3123 1473.5808 1496.6708 1538.5514 1576.9139 1618.8444 2976.0153 3075.1586 3131.4841 3141.9811 3161.7444 3164.7610 3186.3478 3231.0382
redmass: 14.0196 4.4021 4.1869 4.0706 3.1109 3.6798 1.2801 9.1183 4.4365 6.0010 11.4430 6.6422 4.1925 6.8833 4.0472 7.5145 3.8585 4.8492 7.8403 3.8922 7.3140 7.0174 10.1687 2.7190 1.5652 1.7792 5.8673 7.6402 1.4123 7.9014 1.3421 1.3397 5.6276 2.3358 1.2537 1.9588 1.3808 2.5255 1.9894 1.9075 1.8166 4.2963 4.2030 3.0807 4.2788 4.9850 2.1672 1.4894 2.1112 1.0867 1.0516 3.3176 7.1160 6.1631 7.4033 1.0321 1.1051 1.0896 1.1005 1.0958 1.0879 1.0971 1.0934
irintensity: 0.0112 4.7692 0.0013 8.2491 1.5612 5.5825 0.2031 5.5089 1.9451 2.3647 0.1609 2.5701 0.4411 3.7807 11.6603 1.2451 1.4357 13.7574 1.6619 0.2729 0.6331 3.0175 22.2245 0.0036 46.7678 60.2249 11.8965 6.3178 0.0008 14.2868 1.8279 3.0827 55.4155 9.8941 0.0533 84.1255 0.5453 124.7852 149.8174 18.9279 21.8936 204.4582 10.9432 55.7163 8.0710 26.3620 25.4040 4.2314 36.8184 69.8325 16.4641 111.8746 5.5209 9.6887 92.0955 59.7384 33.9477 16.3655 11.6477 23.8579 0.1585 6.5389 14.8365
temp: 298.150 k
press: 1.00000 atm
elementType: 8 8 8 7 7 6 6 6 6 6 6 6 6 6 6 1 1 1 1 1 1 1 1
symmnumber: 1
zpe: 433202.5 jmol-1
zpe.correction: 0.164998 hartree
zpe.thermalcorrener: 0.176459 hartree
zpe.thermalcorrenthalpy: 0.177403 hartree
zpe.thermalcorrgfe: 0.127166 hartree
zpe.sumelectzpe: -719.866456 hartree
zpe.sumelectthermal: -719.854996 hartree
zpe.sumelectthermalent: -719.854052 hartree
zpe.sumelectthermalfe: -719.904289 hartree
dipole: -0.4366 -4.8856 0.0006
dipole: 4.9051
quadrupole: -71.0300 -91.9035 -87.3137
quadrupole: 20.7618 -0.0115 -0.0019
quadrupole: 12.3857 -8.4877 -3.8980 20.7618 -0.0115 -0.0019
hfenergy: -720.0314545 hartree
pointgroup: C01 [X(C10H8N2O3)]
dipole: -0.104627 1.926975 -0.0002399 debye
dipolederiv: -1.7570493 0.6599478 -0.0001757 0.068167 -0.1934804 -0.0001197 -0.0002069 0.0001505 -0.2481896 -0.5677907 0.2190654 0.0010279 0.1437399 -0.8581651 -0.0009435 0.0007309 -0.0004051 -0.2536257 -0.8138035 -0.2602452 0.0010884 -0.2301319 -0.5092182 0.000155 0.0016896 0.0001202 -0.2097315 -0.2123034 -0.1670065 0.0000357 0.0282694 -0.2767409 0.0000263 0.0000943 0.000108 -0.2392827 1.1281996 0.2412499 -0.0025504 0.230187 1.7113719 0.0009118 -0.0026046 0.0005299 0.1925469 0.2891981 0.2085632 0.000027 -0.0112687 -0.1811821 0.0000435 -0.0000677 -0.0005145 0.0717469 -0.3196631 -0.1550009 0.0003582 -0.0539534 -0.8001142 -0.0000275 0.0000938 -0.0001398 -0.0082837 -0.0006516 0.2065844 -0.0000355 -0.0342138 -0.2213733 -0.0000375 -0.0000219 -0.0000896 0.0470304 1.4443535 -0.5095998 0.0002528 0.5075858 0.2432151 0.0000278 0.0003944 0.0002979 0.1386998 0.4010302 -0.1477543 0.0000085 -0.0815669 0.2557187 0.0000166 -0.0000054 0.0000864 -0.0943164 -0.5605606 -0.0147407 -0.0000611 -0.4781235 0.0116575 -0.0000256 -0.0000917 -0.0000353 -0.1848632 -0.1123728 -0.0963002 0.0000571 -0.0310736 0.1019503 -0.0000309 0.0000778 0.000026 -0.1215337 -0.1191647 -0.0510938 0.0000147 -0.266247 0.1252551 0.0000105 0.0000651 0.0001993 -0.0951009 0.3079114 0.1202443 -0.0000351 0.3047865 0.0341406 0.0000148 -0.0002 -0.0000373 -0.059149 0.721742 -0.2676613 0.0000261 -0.4811292 0.4372727 -0.0000523 0.0000338 -0.0001211 0.3038819 0.0925871 -0.0612304 -0.0000056 -0.0134565 -0.0023929 -0.0000062 -0.0000106 -0.0000143 0.150041 0.0179445 0.0951637 0.000015 0.0691693 0.0063335 -0.0000037 0.0000037 -0.0000084 0.1616895 0.2111156 -0.0406893 -0.0000466 0.0542708 0.0670637 0.0000176 0.0000113 -0.0001145 0.1619812 -0.0160844 0.0908538 -0.0000093 0.113677 0.0031238 -0.0000008 0.0000577 0.0000086 0.1550214 -0.1343298 -0.0298302 0.0000123 -0.0474137 0.0816354 0.0000042 0.0000092 -0.0000739 0.1339348 -0.0916084 -0.0136734 -0.0000349 -0.0879905 0.0726931 0. -0.0000237 0.0000055 0.1305449 0.0456242 -0.0134376 0.0646643 0.1483837 -0.0543754 0.0936129 0.0043728 0.1046039 -0.0665279 0.0456759 -0.0134091 -0.0646336 0.1483323 -0.054389 -0.0935932 -0.0044021 -0.1045825 -0.0665143 unknown
polarizability: 219.3581611|-11.7944948|157.4300184|-0.0370367|0.0079262|55.6920176 unknown
InChI: InChI=1S/C10H8N2O3/c1-15-9-5-4-8-7(3-2-6-11-8)10(9)12(13)14/h2-6H,1H3
charge 0 multiplicity 1
23 atoms
O  -2.882688 0.394347 0.000011
O  -0.356453 -2.899005 -0.002238
O  -2.454031 -2.063248 0.003025
N  2.645727 1.44137 -0.00006
N  -1.17605 -1.88728 -0.000106
C  0.820929 -0.286698 -0.000126
C  -0.618721 -0.511483 -0.000012
C  1.304788 1.085342 -0.000034
C  -1.516386 0.604855 0.00014
C  0.376483 2.170323 0.000105
C  -0.988423 1.939645 0.000182
C  1.849387 -1.297141 -0.000109
C  3.196755 -0.924645 -0.000083
C  3.559689 0.453637 -0.000107
C  -3.794535 1.553887 -0.000147
H  0.791112 3.182391 0.000143
H  -1.675093 2.788748 0.000256
H  1.566832 -2.346708 -0.000179
H  3.976501 -1.692737 -0.000074
H  4.611678 0.761269 -0.00014
H  -4.794813 1.099571 -0.000245
H  -3.66149 2.170203 -0.908443
H  -3.661699 2.170255 0.908141
