program: Gaussian 09
title: 000244520
version: EM64L-G09RevD.01
frameworkgroup: C1[X(C6H9N3S2)]
method: RPBEPBE
basis: SDD
operation: Freq
keyword: #pfreq=noraman
keyword: PBEPBE/SDD
title: #p freq=noraman PBEPBE/SDD
converged: YES YES NO NO
title: Mulliken charges:
elementType: S S N N N C C C C C C H H H H H H H H H
charge: 0.161144 0.275827 -0.013676 0.026057 -0.608022 -0.279305 0.245978 -0.284015 -0.371301 -0.833215 -0.830357 0.264667 0.328781 0.327978 0.257667 0.265659 0.275202 0.273872 0.275090 0.241970
chargesum: 0.00000
title: Mulliken charges with hydrogens summed into heavy atoms:
elementType: S S N N N C C C C C C
charge: 0.161144 0.275827 -0.013676 0.026057 0.048736 -0.279305 0.245978 -0.019348 -0.371301 -0.034687 -0.039425
polarizability: 1.94354943e+02 -9.58517954e-01 1.16552288e+02 -1.38542605e-01 8.89416587e-01 6.96369318e+01
1716.lowfreq: -3.8298 -0.0019 -0.0016 0.0016 4.4658 9.1654 46.2105 56.1202 91.9094
frequency: 46.1721 56.1164 91.8994 123.6572 130.9785 148.8589 153.9763 201.9322 229.4074 279.7155 335.6870 359.6167 429.2270 438.2972 515.0730 532.3742 559.4687 584.1447 629.9524 664.1604 669.9900 713.4456 777.7387 897.2465 938.9190 965.4948 976.9693 978.6152 984.8257 998.5268 1051.4973 1170.5259 1266.6795 1284.5547 1325.4353 1338.2829 1350.9511 1423.8131 1435.9448 1443.7582 1452.6928 1459.1467 1506.1147 1523.5724 1602.9124 3013.1620 3022.1988 3137.5412 3142.2773 3143.4295 3145.5383 3152.9627 3511.6684 3676.0237
redmass: 3.4049 4.4712 3.9483 1.1279 1.1097 3.0208 3.6146 7.0560 5.5913 5.7965 5.8168 6.9212 3.5344 3.8347 5.5695 1.3129 7.8950 1.0689 6.6212 7.3219 11.3558 8.4236 9.2397 4.9873 1.4051 1.1726 2.3625 1.1900 1.3072 1.8345 2.2003 4.7551 3.8520 3.8631 1.7727 1.1321 1.3751 3.8073 1.0528 1.0617 1.0700 1.0586 4.4270 3.3374 1.7188 1.0278 1.0282 1.1047 1.1045 1.0945 1.1038 1.1056 1.0455 1.1038
irintensity: 0.9915 0.9346 0.9847 0.2584 0.1204 0.0519 1.1924 2.4005 3.9974 5.6177 3.6480 5.5059 20.3149 20.5719 0.6341 188.6359 7.4124 32.3739 0.4365 0.6872 2.5502 5.6893 15.8870 17.3079 9.3305 4.4043 16.1706 7.8913 35.5069 6.6620 23.5577 151.1310 52.5463 12.1550 159.1186 1.2525 65.1221 64.8602 13.9903 20.4627 17.9826 14.6742 137.1867 181.0044 435.3718 27.7932 24.2371 12.6658 9.0666 11.3082 12.0753 13.3089 71.8828 57.0170
temp: 298.150 k
press: 1.00000 atm
elementType: 16 16 7 7 7 6 6 6 6 6 6 1 1 1 1 1 1 1 1 1
symmnumber: 1
zpe: 388745.5 jmol-1
zpe.correction: 0.148065 hartree
zpe.thermalcorrener: 0.160569 hartree
zpe.thermalcorrenthalpy: 0.161513 hartree
zpe.thermalcorrgfe: 0.108350 hartree
zpe.sumelectzpe: -1193.587150 hartree
zpe.sumelectthermal: -1193.574646 hartree
zpe.sumelectthermalent: -1193.573702 hartree
zpe.sumelectthermalfe: -1193.626864 hartree
dipole: -2.4192 4.1609 1.3542
dipole: 4.9999
quadrupole: -73.1849 -76.0054 -81.3144
quadrupole: 5.0344 -4.4693 -1.0569
quadrupole: 3.6500 0.8295 -4.4795 5.0344 -4.4693 -1.0569
hfenergy: -1193.7352148 hartree
pointgroup: C01 [X(C6H9N3S2)]
dipole: -0.9556351 -1.5234973 -0.7970237 debye
dipolederiv: -0.0390908 0.0115526 -0.0778919 0.0569402 -0.1759746 -0.0249227 -0.1097806 -0.0427061 0.0408948 -0.8117931 0.0652089 0.0965333 -0.0828475 0.0869913 0.0453075 0.1039189 0.0245515 -0.0761699 -1.1766268 -0.4561046 0.032987 -0.489426 -0.7540915 -0.0453525 0.0435678 -0.0390891 -0.1929731 -1.5137358 -0.0136397 0.1239942 0.4571614 -0.5477195 -0.1325753 0.3015862 -0.0893308 -0.2313041 -0.4343307 -0.3476692 -0.1225308 -0.4172695 -1.2170312 -0.0179774 -0.1665867 -0.1190671 -0.6277455 0.0914724 0.1560204 0.0378089 -0.3911607 -0.6145398 -0.050592 0.0566052 -0.1219701 -0.2008703 0.5887159 0.4101364 0.0160332 0.4031665 1.4341249 0.1202613 0.048002 0.1812554 0.2253074 0.7770697 0.1469656 -0.0693494 0.3561297 0.4714946 0.1108379 -0.0392695 0.0974357 0.015709 2.0166204 0.0851604 -0.2527029 -0.0003819 0.5318855 0.0908291 -0.3375155 0.1078946 0.0575438 -0.092084 -0.0155277 0.1278551 -0.0365856 0.0493414 -0.0129502 0.1116338 -0.0250731 0.1107371 0.0909102 -0.1010291 -0.029904 -0.0879208 0.0705016 0.0148336 -0.0272092 0.0221817 0.054311 0.0209094 0.0882423 0.0401855 0.0915008 0.0240088 -0.029082 0.0371132 -0.0249861 0.1041733 0.151381 0.0128571 0.0346448 0.0230698 0.264585 -0.0220956 0.0412794 -0.0018748 0.3547541 0.2467522 -0.0031268 0.0373283 -0.0170357 0.2849332 -0.040127 0.0275859 0.0039828 0.3153908 -0.1496198 -0.0191197 -0.0320521 -0.0171127 0.1259325 0.0119486 -0.0852061 0.0186795 0.0718203 0.0908075 0.0759617 0.0489297 0.048416 0.0102876 -0.0683513 0.0080523 -0.0431977 -0.0778549 0.1071736 -0.0647647 -0.0106435 -0.0096587 -0.0690404 0.0748954 -0.0456998 0.0580366 -0.0127064 0.0728574 -0.0181256 -0.0870604 0.0526821 -0.0012287 -0.0847858 -0.0489902 -0.0568697 -0.0399323 0.1076046 -0.0260824 0.0409147 0.0594395 -0.0629064 0.0678822 0.035793 0.0610207 -0.0090893 -0.1449933 0.0130843 0.0449202 0.0008934 0.0884455 -0.0079837 0.0451198 -0.0108738 0.1180042 unknown
polarizability: 194.0895694|2.8829648|114.572271|-4.9283892|9.5185191|71.8823218 unknown
InChI: InChI=1S/C6H9N3S2/c1-10-4-3-8-6(11-2)9-5(4)7/h3H,7H2,1-2H3
charge 0 multiplicity 1
20 atoms
S  -3.102558 0.139249 0.597246
S  3.175405 0.888984 -0.196788
N  0.890296 -0.633792 -0.163894
N  0.705453 1.736024 0.399572
N  -0.983372 -2.045404 -0.175076
C  -1.290821 0.328131 0.368304
C  -0.464061 -0.789793 0.009258
C  -0.640954 1.561325 0.561259
C  1.394997 0.612232 0.031142
C  -3.680102 0.471088 -1.183588
C  3.740425 -0.837991 -0.678363
H  -1.214736 2.445947 0.858373
H  -0.351573 -2.809504 -0.403987
H  -1.969052 -2.211004 0.029274
H  -4.771689 0.324985 -1.18662
H  -3.199234 -0.237671 -1.874541
H  -3.434056 1.50663 -1.459686
H  3.230923 -1.154799 -1.599014
H  3.516662 -1.543676 0.133627
H  4.826944 -0.75626 -0.839294
