program: Gaussian 09
title: 000244513
version: EM64L-G09RevD.01
frameworkgroup: C1[X(C20H21Cl4N5O2)]
method: RPBEPBE
basis: SDD
operation: Freq
keyword: #p
keyword: freq=noraman
keyword: PBEPBE/SDD
title: #p freq=noraman PBEPBE/SDD
converged: YES YES NO NO
title: Mulliken charges:
elementType: Cl Cl Cl Cl O O N N N N N C C C C C C C C C C C C C C C C C C C C H H H H H H H H H H H H H H H H H H H H H
charge: -0.075377 -0.053909 -0.069369 -0.050121 -0.309142 -0.289374 -0.089452 -0.174408 -0.407716 -0.497157 -0.489442 -0.357188 -0.348164 -0.373199 -0.395248 -0.319766 -0.394841 0.293061 0.636724 0.284976 -0.399409 -0.253028 0.639626 -0.103013 -0.202622 -0.264070 -0.399160 -0.259618 -0.103538 -0.199692 -0.261366 0.207632 0.224638 0.214703 0.190192 0.264842 0.221792 0.231340 0.197034 0.194276 0.227502 0.255404 0.235754 0.292518 0.306037 0.343011 0.297429 0.257731 0.262054 0.338792 0.259084 0.263240
chargesum: 0.00000
title: Mulliken charges with hydrogens summed into heavy atoms:
elementType: Cl Cl Cl Cl O O N N N N N C C C C C C C C C C C C C C C C C C C C
charge: -0.075377 -0.053909 -0.069369 -0.050121 -0.309142 -0.289374 -0.089452 -0.174408 -0.115197 -0.191120 -0.192014 0.075082 0.056731 0.113435 0.033127 0.102012 0.096317 0.293061 0.636724 0.284976 -0.399409 0.089983 0.639626 -0.103013 0.055109 -0.002016 -0.399160 0.079174 -0.103538 0.059392 0.001874
polarizability: 4.32259772e+02 -1.84347501e+01 3.51573523e+02 2.54159026e+00 1.49826358e+01 1.64702983e+02
1716.lowfreq: -5.0524 -1.3485 -0.0005 0.0013 0.0016 1.9421 6.0160 7.8644 10.6067
frequency: 5.2745 7.7340 10.4979 19.3168 31.6037 37.0455 55.0218 60.3896 72.2816 76.4297 85.9009 88.0241 99.0847 102.5344 114.0030 139.1131 170.4464 183.7518 213.2240 214.7172 224.2843 233.1253 243.8096 249.4061 286.4552 299.1393 299.7821 306.0520 308.0882 312.1544 326.1932 328.2129 361.1443 380.8586 401.1841 411.4854 422.0236 426.1553 441.9988 443.7928 469.8360 477.2623 505.7071 516.1095 564.3180 572.9614 576.8366 595.4634 612.5904 619.4519 636.6617 644.3301 695.7182 697.8278 704.0753 706.1947 709.1980 709.8955 712.1438 772.2221 788.5397 790.2429 793.1498 829.9129 839.2965 888.8649 890.3896 914.9683 918.8523 930.2139 931.3643 946.2255 953.7275 983.7633 996.8834 1004.7712 1008.5771 1045.9285 1049.9477 1070.8449 1076.6776 1076.8500 1084.9400 1099.2802 1109.9831 1133.1187 1135.1719 1144.2464 1153.3886 1184.8264 1202.7785 1220.8491 1234.6898 1236.3463 1241.5428 1250.5816 1266.5724 1269.5636 1281.5696 1296.3345 1308.0705 1324.7373 1342.6037 1352.3901 1359.2426 1367.7962 1369.5279 1375.6904 1392.3330 1397.0238 1412.9881 1413.3455 1440.1074 1446.9562 1448.3562 1454.6171 1458.0174 1463.2776 1467.7102 1479.4222 1488.9401 1507.8947 1511.5607 1569.5895 1571.1364 1603.4324 1608.1532 1620.6369 1646.9026 2860.9579 2882.2593 2908.7039 2966.7231 2976.7744 3019.7995 3026.6797 3036.6460 3060.0551 3064.8541 3095.0225 3099.3750 3166.5468 3166.7575 3187.1039 3187.9891 3188.3228 3189.0202 3483.9681 3515.0170 3554.8315
redmass: 10.2506 17.2080 7.8972 6.0496 4.3121 6.9026 5.3821 6.2904 4.9743 8.1323 6.5335 8.1680 9.7149 7.6015 4.5395 6.3207 9.6975 4.5031 4.3321 4.3404 4.9163 4.1458 3.8202 2.8451 4.8848 5.2755 5.7759 9.2142 11.1731 4.9895 4.5740 3.0813 3.0074 2.1561 3.1081 2.5577 4.4576 5.1211 3.1993 3.0209 2.8821 5.4757 9.3418 7.9944 2.4805 3.6333 3.9628 4.8283 1.6623 5.1028 1.3209 2.8268 3.1738 9.1980 6.4401 6.2080 5.2589 4.8398 5.5386 3.5152 1.3238 1.3246 1.6070 4.3297 1.6579 6.3958 6.2733 1.3616 1.3362 1.3454 1.3519 2.8088 3.1948 3.2774 3.0436 6.8791 5.0783 2.7687 2.1267 2.3774 1.8589 1.8324 2.1464 2.6098 3.7924 1.3821 1.3969 2.5709 2.6798 1.7716 1.1540 1.9941 1.6872 1.6636 1.8270 1.7300 1.7068 1.7885 1.3881 1.3839 1.2062 1.3035 1.2564 1.3320 2.5727 2.9067 1.9385 1.5245 1.8468 1.7690 4.0452 3.9756 1.9282 1.2935 1.9637 1.3470 1.0864 1.1031 1.0979 1.0983 1.7577 2.7097 2.8302 5.2340 4.9038 7.1699 7.9553 4.6027 4.1983 1.0704 1.0706 1.0677 1.0654 1.0680 1.0920 1.0605 1.0896 1.0904 1.0958 1.1048 1.0942 1.0892 1.0892 1.0958 1.0954 1.0951 1.0952 1.0760 1.0749 1.0779
irintensity: 0.0398 0.0896 0.1207 0.7014 1.9100 0.3137 6.2966 1.4235 2.6537 0.9352 0.8156 0.8781 3.8557 5.3761 4.1497 0.3237 0.6236 6.4952 0.2206 0.9698 3.3460 1.0505 2.6041 3.8631 3.4097 2.1005 0.3181 0.8549 0.8196 4.4282 10.5305 11.2780 18.7963 19.8777 28.1754 17.3972 3.0813 4.3360 18.6311 39.7158 4.3357 1.9360 60.3570 3.6703 7.0393 5.2894 24.6472 4.7572 46.2023 1.2960 128.5169 0.6516 1.7660 17.3351 14.0116 3.9731 12.4581 18.8004 20.7593 3.9535 45.9589 48.0717 3.9091 9.7432 1.6276 73.1943 21.1652 27.9062 17.7588 6.9416 17.2525 4.0947 4.9638 36.9176 100.0184 89.4278 36.1964 8.7781 1.1154 8.9580 29.4765 17.6047 6.1508 27.5098 11.9488 2.7247 7.4869 99.7623 27.6536 9.4508 28.0048 481.9810 183.9255 5.6070 4.1702 170.3081 49.5397 28.5359 9.6088 100.2936 19.9463 3.8634 5.5293 3.8352 55.6380 89.5276 59.8504 13.8847 125.0578 141.9938 150.5398 64.9003 71.0378 7.8786 19.0366 19.1799 0.0178 41.0990 16.9944 10.3711 347.7462 1139.9503 245.6712 64.2681 54.8236 61.6558 195.0282 452.3907 147.6712 69.9327 50.5738 83.0900 36.8324 59.2492 15.1330 38.5486 48.3701 40.6593 37.7319 13.8801 6.1459 0.5636 0.5830 5.1870 6.6286 25.7716 25.9450 46.9728 32.2407 24.5168
temp: 298.150 k
press: 1.00000 atm
elementType: 17 17 17 17 8 8 7 7 7 7 7 6 6 6 6 6 6 6 6 6 6 6 6 6 6 6 6 6 6 6 6 1 1 1 1 1 1 1 1 1 1 1 1 1 1 1 1 1 1 1 1 1
symmnumber: 1
zpe: 1023442.3 jmol-1
zpe.correction: 0.389809 hartree
zpe.thermalcorrener: 0.420218 hartree
zpe.thermalcorrenthalpy: 0.421162 hartree
zpe.thermalcorrgfe: 0.320563 hartree
zpe.sumelectzpe: -3036.935977 hartree
zpe.sumelectthermal: -3036.905568 hartree
zpe.sumelectthermalent: -3036.904623 hartree
zpe.sumelectthermalfe: -3037.005222 hartree
dipole: 2.8383 -8.3949 -1.3634
dipole: 8.9660
quadrupole: -211.4459 -212.1318 -212.8071
quadrupole: 2.2679 4.4593 -3.5478
quadrupole: 0.6824 -0.0035 -0.6788 2.2679 4.4593 -3.5478
hfenergy: -3037.3257855 hartree
pointgroup: C01 [X(C20H21Cl4N5O2)]
dipole: 1.05586 3.0071763 1.5116992 debye
polarizability: 431.4224064|20.8116605|326.4913201|1.0798995|66.308629|190.6225519 unknown
InChI: InChI=1S/C20H21Cl4N5O2/c21-13-1-3-15(23)17(11-13)26-19(30)25-5-6-28-7-9-29(10-8-28)20(31)27-18-12-14(22)2-4-16(18)24/h1-4,11-12,25-27H,5-10H2
charge 0 multiplicity 1
52 atoms
Cl -6.852028 2.047688 1.869452
Cl -8.566595 -3.45673 -0.966101
Cl 8.228911 2.242186 1.277236
Cl 7.458413 -3.773742 -0.839971
O  -4.158894 -1.11269 -1.487695
O  3.95391 -0.149506 -0.902449
N  -0.168563 1.5146 -0.171421
N  -2.871741 0.663714 -0.685659
N  3.595263 2.066337 -0.269011
N  -5.121373 0.413245 0.024683
N  5.698301 1.10406 0.097486
C  -0.432279 0.248222 -0.905415
C  -1.228294 1.740525 0.835488
C  -1.78236 0.333851 -1.633974
C  -2.608029 1.854357 0.14737
C  1.207212 1.60418 0.369723
C  2.199706 2.055907 -0.732127
C  -4.055471 -0.075976 -0.75984
C  -6.386558 -0.178082 0.204101
C  4.386397 0.927129 -0.391126
C  -7.331743 0.470175 1.051372
C  -6.789901 -1.396389 -0.413284
C  6.731101 0.147211 0.136947
C  -8.077049 -1.895844 -0.161394
C  -8.614892 -0.041071 1.290335
C  -9.008256 -1.251958 0.676037
C  7.998223 0.522468 0.668549
C  6.582793 -1.190411 -0.327184
C  7.675556 -2.067084 -0.240009
C  9.080166 -0.365593 0.746573
C  8.927467 -1.69303 0.285425
H  -0.439699 -0.626319 -0.208832
H  0.366221 0.07703 -1.647492
H  -1.022996 2.68576 1.371149
H  -1.273081 0.915227 1.590997
H  -2.037415 -0.624056 -2.113312
H  -1.724659 1.122485 -2.411734
H  -2.618006 2.766561 -0.484404
H  -3.365558 1.969997 0.941134
H  1.214691 2.347426 1.190089
H  1.561808 0.636193 0.795856
H  2.143626 1.364667 -1.589435
H  1.922316 3.064012 -1.086424
H  3.951381 2.905531 0.189784
H  -5.007412 1.306359 0.508255
H  -6.083826 -1.904413 -1.072259
H  5.963216 2.0262 0.457601
H  -9.304231 0.494639 1.948515
H  -10.002717 -1.67003 0.847901
H  5.621371 -1.497691 -0.742276
H  10.034599 -0.030859 1.161717
H  9.756875 -2.402169 0.336454
