program: Gaussian 09
title: 000244506
version: EM64L-G09RevD.01
frameworkgroup: C1[X(C7H11Cl3O3)]
method: RPBEPBE
basis: SDD
operation: Freq
keyword: #p
keyword: freq=noraman
keyword: PBEPBE/SDD
title: #p freq=noraman PBEPBE/SDD
converged: YES YES NO NO
title: Mulliken charges:
elementType: Cl Cl Cl O O O C C C C C C C H H H H H H H H H H H
charge: 0.144332 0.119960 0.105392 -0.297312 -0.221527 -0.196196 0.066077 -0.393195 -0.312827 -0.700907 -0.514151 0.480122 -0.729545 0.190611 0.219998 0.220998 0.268614 0.233552 0.219259 0.223452 0.213030 0.230890 0.231660 0.197713
chargesum: 0.00000
title: Mulliken charges with hydrogens summed into heavy atoms:
elementType: Cl Cl Cl O O O C C C C C C C
charge: 0.144332 0.119960 0.105392 -0.297312 -0.221527 -0.196196 0.256688 0.047800 0.189340 -0.045166 0.146113 0.480122 -0.729545
polarizability: 1.18912208e+02 -1.23255624e+00 1.19319266e+02 5.19302554e+00 -1.40452735e+00 1.02671434e+02
1716.lowfreq: -11.5666 -5.0376 -2.2221 -0.0036 -0.0028 -0.0024 10.5081 31.8385 43.2232
frequency: 5.7633 31.8129 43.1927 61.0348 90.2754 100.2078 118.3634 178.7557 183.2737 195.7714 211.3110 231.8199 250.6722 266.1427 277.3467 306.4477 329.9109 368.3888 392.6036 423.3705 465.2467 513.4729 607.7956 689.8496 728.3940 749.3035 754.4784 798.9405 855.5204 886.5494 939.2504 978.5372 1008.6028 1043.1472 1095.1267 1115.0300 1118.3043 1134.5153 1152.3692 1166.8042 1221.4964 1259.7088 1310.8527 1319.5374 1353.8442 1369.1945 1383.3608 1425.4790 1437.7587 1458.7246 1460.3798 1467.9079 1471.3563 1477.2391 1643.7354 2938.9242 2944.1260 2982.6464 2998.9912 3024.9082 3044.8848 3065.7647 3078.7760 3088.6869 3101.7293 3126.1934
redmass: 6.8570 7.9790 3.8287 8.3064 2.6731 3.6145 5.6562 1.7794 5.2423 1.0525 5.2289 3.7671 6.1309 17.3254 3.4968 4.3113 2.8153 5.3741 20.4954 3.4694 2.4672 2.7769 12.0956 6.5188 5.1298 3.6000 12.0102 4.9640 2.2655 1.8996 4.6270 1.5750 2.9916 4.5569 2.0701 1.9807 1.4425 1.9772 1.4427 5.8594 1.2736 1.3005 1.2293 1.2234 1.2704 1.6779 1.2243 1.0874 1.1372 1.0956 1.0536 1.0530 1.0513 1.0524 10.5925 1.0623 1.0533 1.0360 1.0608 1.1029 1.0601 1.0975 1.0985 1.1004 1.0986 1.1102
irintensity: 0.1405 0.3358 0.3128 2.9710 4.5492 2.5357 0.8681 0.7175 2.0036 0.4750 1.7643 5.4450 1.8620 0.4902 6.0161 6.8432 8.3158 8.0690 2.9234 9.8200 0.5196 2.5280 129.1949 30.7264 68.3796 28.5816 60.9343 47.3813 7.7905 3.2241 92.5793 5.5683 54.4443 78.9147 7.3031 15.7581 8.7343 43.3703 10.6431 251.2262 9.5341 9.5645 1.3798 14.8662 7.9688 11.4403 19.0984 13.0672 3.4643 19.5408 11.8810 5.2287 6.7045 11.8903 145.1509 51.5570 59.7069 18.2802 20.2790 58.8600 19.7738 13.6168 40.6041 30.6928 31.0055 5.8291
temp: 298.150 k
press: 1.00000 atm
elementType: 17 17 17 8 8 8 6 6 6 6 6 6 6 1 1 1 1 1 1 1 1 1 1 1
symmnumber: 1
zpe: 456518.4 jmol-1
zpe.correction: 0.173879 hartree
zpe.thermalcorrener: 0.189942 hartree
zpe.thermalcorrenthalpy: 0.190886 hartree
zpe.thermalcorrgfe: 0.126498 hartree
zpe.sumelectzpe: -1878.113180 hartree
zpe.sumelectthermal: -1878.097117 hartree
zpe.sumelectthermalent: -1878.096173 hartree
zpe.sumelectthermalfe: -1878.160561 hartree
dipole: 2.1377 -1.1397 0.6138
dipole: 2.4991
quadrupole: -99.7003 -95.0532 -96.3796
quadrupole: -0.8204 3.7440 3.2347
quadrupole: -2.6559 1.9912 0.6648 -0.8204 3.7440 3.2347
hfenergy: -1878.2870591 hartree
pointgroup: C01 [X(C7H11Cl3O3)]
dipole: 0.8657304 -0.2692638 0.3804 debye
dipolederiv: -0.2098479 0.1852241 -0.1234627 0.1886293 -0.5216528 0.2308241 -0.1022749 0.2037531 -0.2219754 -0.4467142 -0.3166948 -0.0494091 -0.309763 -0.5116184 -0.0675446 -0.0052067 -0.0479509 -0.132797 -0.2373973 -0.012384 -0.1288839 -0.0226903 -0.1528102 -0.1103278 -0.1468458 -0.1204842 -0.7109398 -0.5372368 -0.1070376 0.0930697 -0.1374172 -0.6123809 0.2383471 0.0273752 0.2958924 -0.7950073 -1.0804877 0.4924995 -0.0269818 0.7195193 -0.8775864 0.1627696 -0.0437791 0.1473486 -0.3676156 -0.5961871 -0.0561217 0.2512562 0.1673813 -0.5288835 0.1676795 0.033515 0.3231052 -0.5946266 0.4936829 0.1173088 -0.0723584 0.0715495 0.2607374 -0.0239062 -0.0679535 -0.1490999 0.6664523 -0.0490134 -0.0324664 -0.0328201 -0.0245623 -0.036852 0.015007 -0.0528292 -0.053389 0.0086905 0.7751583 -0.2768835 0.007813 -0.2597574 0.3633865 0.0069211 -0.0957235 0.1540063 0.1858364 -0.0902789 -0.0804268 -0.1157186 -0.0897311 0.019302 -0.0564427 -0.0588126 0.0066466 -0.1043381 0.3462687 0.0309723 0.0115812 0.0908778 0.5128978 -0.2503407 -0.0042198 -0.1365315 0.3366198 1.0845573 -0.3656372 -0.3703453 -0.7412315 0.9075629 -0.3460048 -0.1290183 -0.4921287 0.6409888 0.7166847 0.2150034 0.4190491 0.17716 1.2668559 -0.0595068 0.4608412 -0.0870886 1.0663398 -0.1343776 0.0828617 0.0428851 0.145963 -0.049612 -0.0270703 0.0168144 0.0334544 -0.0377372 -0.075628 0.1331559 0.0150547 0.050334 0.0165696 -0.0275119 -0.0012754 -0.0437118 0.0958105 0.0809322 -0.0511241 0.0602295 -0.0501997 0.0611053 0.0180985 0.0253397 0.0413691 -0.1096905 0.0594308 0.0854308 -0.0105648 0.0583292 0.0983631 0.0847261 0.0228823 -0.0128452 -0.0166132 -0.0443118 -0.0408801 -0.0136973 -0.0142087 -0.1219878 -0.033725 0.0201097 -0.0127358 0.1032798 0.0310123 -0.0720256 -0.0136974 -0.1138315 -0.1275547 0.0124019 0.0094075 0.0493841 0.0961702 -0.0508156 0.084534 -0.0213744 0.1425072 -0.0110625 -0.0020695 0.0192439 -0.0412977 0.0853913 0.0555105 -0.0002171 0.0917828 -0.0002287 0.1012556 0.0237031 0.0623178 0.0161664 -0.1385628 -0.1147807 0.1177948 -0.0265948 0.0738767 -0.0047293 0.0509736 0.0323759 -0.00545 0.0699093 0.0816695 -0.0051239 0.0731428 0.0074657 0.0701244 -0.0146778 0.0878666 0.0290424 -0.1401675 -0.0578303 -0.1277624 -0.0599554 -0.1299718 -0.1214301 0.0076766 -0.1101506 -0.0974551 0.0145822 unknown
polarizability: 119.7603166|0.9294338|112.6373452|3.7722424|-8.5516628|108.5052455 unknown
InChI: InChI=1S/C7H11Cl3O3/c1-5(12-2)3-4-13-6(11)7(8,9)10/h5H,3-4H2,1-2H3
charge 0 multiplicity 1
24 atoms
Cl -3.03586 1.845333 -0.382018
Cl -3.549158 -1.059272 0.262647
Cl -1.95197 0.678786 2.186598
O  2.941879 0.094726 -0.936748
O  -0.494691 -1.199261 0.25475
O  -0.505125 0.564532 -1.283294
C  2.441861 0.03819 0.452126
C  1.955499 -1.412141 0.634364
C  0.790992 -1.775277 -0.289899
C  3.540771 0.419084 1.459657
C  2.923129 1.437867 -1.520512
C  -0.997445 -0.0684 -0.330433
C  -2.31992 0.333717 0.387475
H  1.584569 0.740258 0.557975
H  2.800472 -2.08629 0.391055
H  1.672692 -1.597316 1.686989
H  0.958698 -1.385202 -1.307843
H  0.592498 -2.858192 -0.301763
H  3.908249 1.445226 1.280658
H  4.397286 -0.273124 1.371967
H  3.155879 0.375344 2.495515
H  1.895731 1.85487 -1.51698
H  3.264732 1.319133 -2.561119
H  3.608932 2.132409 -0.992567
