program: Gaussian 09
title: 000244505
version: EM64L-G09RevD.01
frameworkgroup: C1[X(C13H21ClO2)]
method: RPBEPBE
basis: SDD
operation: Freq
keyword: #p
keyword: freq=noraman
keyword: PBEPBE/SDD
title: #p freq=noraman PBEPBE/SDD
converged: NO YES NO NO
title: Mulliken charges:
elementType: Cl O O C C C C C C C C C C C C C H H H H H H H H H H H H H H H H H H H H H
charge: -0.076211 -0.305593 -0.276895 0.276357 0.348274 -0.211627 0.274916 -0.532895 -0.545625 -0.481718 -0.827637 -0.788204 -0.778577 -0.030292 -0.357426 -0.597787 0.241590 0.254369 0.213566 0.254616 0.229347 0.230136 0.208414 0.218598 0.232173 0.215805 0.235514 0.214054 0.213442 0.202555 0.268596 0.208384 0.251091 0.246699 0.211642 0.282770 0.277578
chargesum: 0.00000
title: Mulliken charges with hydrogens summed into heavy atoms:
elementType: Cl O O C C C C C C C C C C C C C
charge: -0.076211 -0.305593 -0.276895 0.276357 0.348274 0.029963 0.274916 -0.064961 -0.061661 -0.043168 -0.161060 -0.125194 -0.099042 0.220799 0.100915 -0.037438
polarizability: 1.86338407e+02 4.14096342e+00 1.33170288e+02 5.65821117e-01 -1.01075900e+00 1.24721079e+02
1716.lowfreq: -30.4468 -12.0434 -0.0022 -0.0018 0.0007 6.3411 38.5093 51.6739 99.4839
frequency: 37.4834 50.9252 99.4010 126.2187 148.7141 171.7271 181.0317 193.6071 213.1204 222.7638 238.1725 240.4534 258.6647 295.3539 332.4051 364.4467 382.2592 384.6607 404.8662 435.1284 456.2419 499.7839 522.4333 582.1803 619.8560 651.3078 657.9590 703.2067 719.7042 739.9074 792.2739 815.9239 839.6727 849.3193 870.3990 900.2927 912.9261 937.8235 940.5063 942.6608 947.3475 960.0761 973.2497 990.8887 1004.0278 1023.1327 1043.3221 1045.8300 1072.2098 1091.2371 1106.1326 1107.6921 1136.2822 1147.1486 1167.8327 1173.4134 1196.8041 1205.4595 1213.1852 1222.6975 1236.0059 1243.9014 1253.8526 1265.1719 1272.4724 1292.1596 1303.2323 1312.8494 1325.2518 1357.0485 1379.9735 1380.5271 1400.2383 1446.9233 1450.9423 1458.7868 1464.2187 1468.6888 1470.8517 1477.9610 1484.1758 1489.0099 1494.0755 1503.1466 2976.3970 2978.1349 2981.0774 2990.5650 3005.6527 3017.1187 3021.5919 3052.9126 3054.3543 3054.6319 3059.9960 3061.3481 3064.6830 3071.9606 3081.8283 3083.9080 3091.5553 3096.9333 3110.2543 3112.1612 3162.6144
redmass: 6.5143 4.3533 3.0995 2.0870 1.3553 1.4482 2.6184 1.9190 1.2940 3.7844 2.9861 2.5064 3.3689 3.2974 2.0228 2.8903 2.6386 2.2932 2.7630 2.2981 3.5504 2.7876 3.2339 4.0465 4.1946 5.3581 3.2877 5.6158 3.8964 2.9835 2.6604 1.5565 2.7105 2.6536 2.2568 2.3012 2.1869 2.4376 1.6074 2.3291 1.6244 1.9987 3.2009 1.5094 1.6163 1.6280 2.5291 1.9024 2.5757 1.5123 1.4818 1.7017 2.1010 1.3853 2.2290 1.8070 1.8357 1.8873 1.4334 1.9199 1.2552 1.7661 1.7225 2.0761 1.3858 1.5001 1.7812 2.0596 1.2922 1.4556 1.2036 1.2497 1.1958 1.0971 1.0809 1.0570 1.0508 1.0627 1.0864 1.0564 1.0663 1.0605 1.0727 1.0587 1.0383 1.0363 1.0378 1.0666 1.0600 1.0614 1.0665 1.0913 1.0902 1.0948 1.1009 1.0986 1.0976 1.0574 1.0982 1.1026 1.0975 1.0994 1.0956 1.0997 1.1121
irintensity: 0.0576 0.3691 1.2116 0.7945 0.1705 1.2734 11.1271 0.1318 1.0872 3.2354 0.4701 2.4101 4.9262 3.4562 0.8223 1.8411 0.3350 2.5897 0.1459 1.6546 3.3950 3.1713 1.1763 1.7234 3.1478 53.1164 1.2130 33.9772 9.3358 2.8698 27.4327 5.9445 12.5956 0.7077 5.7703 7.1772 0.5337 28.4642 0.8722 69.3772 0.4337 7.5695 8.4441 2.4732 26.4707 5.5296 14.4593 10.1219 146.6530 2.4724 6.2420 46.1615 5.8744 2.1672 7.0521 3.7783 14.0467 8.9941 4.6783 5.4507 0.8310 6.1791 8.4518 5.1886 5.5380 1.2049 11.1724 5.4449 2.1776 1.7519 11.6769 10.8485 34.2202 14.7842 3.1878 4.3325 4.8052 20.4373 7.1801 8.9138 7.6324 2.9272 25.6867 7.4061 15.7136 30.8782 64.9659 44.8721 38.3180 22.2837 44.1623 26.3540 18.3760 20.2982 24.8719 86.7110 25.6781 11.8064 15.3067 13.1669 49.1544 23.7002 13.3824 10.2198 6.6080
temp: 298.150 k
press: 1.00000 atm
elementType: 17 8 8 6 6 6 6 6 6 6 6 6 6 6 6 6 1 1 1 1 1 1 1 1 1 1 1 1 1 1 1 1 1 1 1 1 1
symmnumber: 1
zpe: 830955.4 jmol-1
zpe.correction: 0.316494 hartree
zpe.thermalcorrener: 0.332717 hartree
zpe.thermalcorrenthalpy: 0.333661 hartree
zpe.thermalcorrgfe: 0.273721 hartree
zpe.sumelectzpe: -1117.203578 hartree
zpe.sumelectthermal: -1117.187356 hartree
zpe.sumelectthermalent: -1117.186411 hartree
zpe.sumelectthermalfe: -1117.246352 hartree
dipole: -1.8358 0.4533 -0.7270
dipole: 2.0259
quadrupole: -112.9384 -103.3179 -104.7146
quadrupole: 1.9918 -1.9940 -3.5250
quadrupole: -5.9481 3.6724 2.2757 1.9918 -1.9940 -3.5250
hfenergy: -1117.5200723 hartree
pointgroup: C01 [X(C13H21Cl1O2)]
dipole: 0.6707699 -0.0840617 0.4222346 debye
polarizability: 183.3102459|-12.3566026|132.8376722|6.1184914|2.7345402|128.0818555 unknown
InChI: InChI=1S/C13H21ClO2/c1-11(2)9-4-5-12(11,3)13(6-9)15-8-10(7-14)16-13/h9-10H,4-8H2,1-3H3
charge 0 multiplicity 1
37 atoms
Cl -4.992121 0.627844 -1.111711
O  -1.333226 -0.586887 0.351597
O  -0.825489 1.6569 -0.109436
C  0.899004 -0.022598 -0.775515
C  1.836702 -0.974174 0.088646
C  2.040334 0.103217 1.218664
C  -0.189697 0.385214 0.272126
C  0.576883 0.437397 1.633634
C  1.803621 1.253434 -0.923891
C  2.588234 1.332496 0.43366
C  0.348014 -0.559279 -2.095587
C  3.146129 -1.374979 -0.633285
C  1.172843 -2.286833 0.576278
C  -2.60999 0.172401 0.302422
C  -2.163911 1.635092 0.507572
C  -3.241406 -0.10383 -1.064147
H  2.673977 -0.219237 2.062327
H  0.165079 -0.310844 2.330579
H  0.490792 1.435658 2.098871
H  1.19355 2.150071 -1.11427
H  2.48262 1.124684 -1.785315
H  3.679639 1.262522 0.281086
H  2.392588 2.276099 0.973646
H  1.172714 -0.83499 -2.778082
H  -0.286404 -1.449024 -1.938351
H  -0.260845 0.210981 -2.604712
H  3.712264 -0.520465 -1.038208
H  3.810386 -1.91507 0.067725
H  2.928527 -2.061125 -1.47319
H  1.839407 -2.799951 1.295744
H  0.192968 -2.13427 1.052875
H  1.015704 -2.974435 -0.276098
H  -3.261008 -0.19749 1.112959
H  -2.788188 2.368175 -0.024106
H  -2.106394 1.886187 1.58493
H  -3.363989 -1.181028 -1.241888
H  -2.68481 0.376838 -1.881546
