program: Gaussian 09
title: 000244503
version: EM64L-G09RevD.01
frameworkgroup: C1[X(C17H18O2)]
method: RPBEPBE
basis: SDD
operation: Freq
keyword: #pfreq=noraman
keyword: PBEPBE/SDD
title: #p freq=noraman PBEPBE/SDD
converged: YES YES NO NO
title: Mulliken charges:
elementType: O O C C C C C C C C C C C C C C C C C H H H H H H H H H H H H H H H H H H
charge: -0.296239 -0.258845 0.005212 -0.267282 -0.204903 -0.334979 0.545824 0.489619 -0.716162 -0.392914 -0.436173 -0.448200 -0.375323 -0.245009 -0.224552 -0.222804 -0.225463 -0.244448 -0.238891 0.221743 0.221824 0.225768 0.230204 0.216209 0.206016 0.249279 0.225826 0.224391 0.229447 0.232454 0.251933 0.221764 0.223139 0.228040 0.226943 0.226400 0.230150
chargesum: 0.00000
title: Mulliken charges with hydrogens summed into heavy atoms:
elementType: O O C C C C C C C C C C C C C C C C C
charge: -0.296239 -0.258845 0.226955 -0.045458 0.020865 0.111435 0.545824 0.489619 -0.035041 -0.168523 -0.206726 -0.215746 -0.123390 -0.023245 -0.001413 0.005236 0.001481 -0.018048 -0.008741
polarizability: 2.61249631e+02 1.49602218e+01 1.35002679e+02 3.63918655e+00 1.07312762e+01 1.52688159e+02
1716.lowfreq: -5.7313 -0.0004 0.0001 0.0008 5.1085 11.3282 18.5684 23.8808 33.3261
frequency: 14.0026 23.2249 33.1091 34.7107 76.4160 95.6955 113.6516 184.5752 203.1180 223.6238 228.3757 244.9658 285.5503 306.1933 369.3465 397.8063 402.6671 404.7351 451.5055 517.9762 540.4947 568.5952 590.7031 616.2255 617.2014 635.4321 681.7455 702.9603 704.3334 763.3181 768.6411 781.7405 822.3720 839.3146 847.8448 854.8934 892.8103 911.6090 920.4768 924.7973 936.6538 970.9394 977.6652 980.3445 990.2017 990.5155 991.8336 997.3868 1012.2180 1025.9429 1028.9449 1040.3003 1051.4675 1061.1148 1087.5425 1099.7032 1137.1792 1167.2226 1171.6143 1172.9097 1184.6461 1188.9673 1207.1666 1215.3311 1243.0359 1265.0349 1276.6054 1291.3423 1295.7471 1321.0896 1333.6649 1349.0146 1362.0478 1384.6355 1389.2120 1393.1745 1441.3654 1442.9383 1470.5160 1474.7468 1484.3099 1485.3644 1485.9909 1593.9830 1595.7743 1614.3843 1616.7580 2964.6442 2970.8983 2990.7026 2991.4416 3009.8443 3083.5399 3090.2589 3102.4169 3115.9884 3117.6891 3119.5200 3128.1052 3132.7972 3140.7472 3143.3100 3152.8909 3161.3986 3166.0725
redmass: 5.5660 3.8698 3.8393 4.5272 4.2569 3.8453 4.4228 3.8721 2.3436 3.7354 1.4303 3.3402 3.6115 3.8674 5.5448 4.4811 2.8048 2.8253 3.4219 3.3947 3.0935 2.9799 4.4912 6.2955 6.4157 5.7094 7.9414 1.6794 1.7950 1.8370 1.9433 3.3276 4.3280 2.8545 1.2528 1.2546 2.7849 1.8489 1.6521 2.0853 4.7070 1.3963 1.5620 2.3140 5.6173 5.4292 1.3420 1.3554 2.3058 2.1284 2.3194 2.6266 2.2564 2.3163 1.5965 1.7791 2.2858 1.2713 1.0547 1.0550 1.1082 1.1098 1.9005 1.8192 1.1666 1.4228 1.2790 1.6283 1.3747 1.2589 1.3053 1.4010 1.6071 5.8288 3.4132 1.4134 2.1595 2.1493 1.1130 1.0909 1.3058 1.7705 1.9254 6.0246 6.1394 6.1988 6.1647 1.0852 1.0847 1.0373 1.0635 1.0848 1.0987 1.1021 1.1004 1.0850 1.0873 1.0872 1.0865 1.0915 1.0916 1.0962 1.0957 1.1016 1.1013
irintensity: 0.9549 0.1038 0.3117 0.2580 1.2337 4.4905 1.8527 0.5726 0.9253 1.0500 0.1913 1.1997 0.1627 0.8312 0.8634 6.5634 0.0568 0.5647 5.5014 7.1749 34.1989 9.0502 2.5473 1.1224 0.2956 10.6771 6.3411 42.8247 56.9158 40.6666 52.1421 2.5430 2.5063 37.0998 0.0419 0.3875 19.9562 25.2848 8.1762 28.9421 19.5869 0.1368 1.2508 5.6149 1.8277 0.6816 0.0589 1.7842 1.4352 7.1933 84.6147 244.7722 12.2507 9.9391 6.1876 10.1031 19.8095 0.4396 0.0734 0.1726 1.3093 0.0235 0.7961 3.0556 13.4710 1.1344 0.7674 5.4146 8.9743 2.5879 2.5532 11.0615 8.8413 2.2381 4.0240 20.6262 8.6461 10.9887 4.1710 5.5612 18.5666 25.0739 4.8054 1.5502 0.6874 9.0031 2.6538 43.4315 34.3016 34.2154 44.9855 35.5023 28.7007 24.1461 28.6407 9.4506 7.7748 2.6808 0.1540 17.6546 19.8221 48.2562 34.4677 25.6468 19.0521
temp: 298.150 k
press: 1.00000 atm
elementType: 8 8 6 6 6 6 6 6 6 6 6 6 6 6 6 6 6 6 6 1 1 1 1 1 1 1 1 1 1 1 1 1 1 1 1 1 1
symmnumber: 1
zpe: 798373.2 jmol-1
zpe.correction: 0.304084 hartree
zpe.thermalcorrener: 0.320904 hartree
zpe.thermalcorrenthalpy: 0.321848 hartree
zpe.thermalcorrgfe: 0.256329 hartree
zpe.sumelectzpe: -807.659461 hartree
zpe.sumelectthermal: -807.642641 hartree
zpe.sumelectthermalent: -807.641697 hartree
zpe.sumelectthermalfe: -807.707216 hartree
dipole: 1.5854 -0.3122 0.2202
dipole: 1.6308
quadrupole: -99.4638 -113.4810 -105.8672
quadrupole: -2.5800 2.2627 4.6634
quadrupole: 6.8069 -7.2103 0.4034 -2.5800 2.2627 4.6634
hfenergy: -807.9635451 hartree
pointgroup: C01 [X(C17H18O2)]
dipole: 0.6294453 0.0499708 0.1138855 debye
polarizability: 259.0666338|11.5897416|158.2100947|-19.1531271|-2.4048976|131.6637401 unknown
InChI: InChI=1S/C17H18O2/c1-13(14-8-4-2-5-9-14)17-18-12-16(19-17)15-10-6-3-7-11-15/h2-11,13,16-17H,12H2,1H3
charge 0 multiplicity 1
37 atoms
O  0.764232 -0.655071 -0.712584
O  -0.409607 -0.528773 1.343831
C  -0.573266 -0.771591 -0.116398
C  -1.519122 0.25861 -0.769356
C  1.740727 -0.892732 0.38713
C  1.014076 -0.215425 1.576802
C  -2.927944 0.131836 -0.186348
C  3.083538 -0.300395 0.024455
C  -1.493159 0.10602 -2.312101
C  -3.747832 -0.988258 -0.483316
C  -3.440565 1.13139 0.677098
C  4.274584 -0.999101 0.337505
C  3.1693 0.97295 -0.593508
C  -5.044546 -1.102582 0.064412
C  -4.738947 1.024134 1.224767
C  5.536524 -0.429639 0.052349
C  4.428564 1.538366 -0.887019
C  -5.547054 -0.09496 0.920098
C  5.616563 0.841618 -0.560403
H  -0.956399 -1.808575 -0.220151
H  -1.115197 1.255297 -0.506369
H  1.827868 -1.983776 0.57106
H  1.292316 -0.632307 2.557974
H  1.185922 0.878708 1.563863
H  -1.846596 -0.892462 -2.628624
H  -0.466989 0.237255 -2.693841
H  -2.15173 0.859022 -2.779318
H  -3.378837 -1.775884 -1.151707
H  -2.813058 1.995334 0.927257
H  4.216768 -1.991962 0.801194
H  2.246451 1.495482 -0.867357
H  -5.663019 -1.975132 -0.175782
H  -5.117292 1.809195 1.889495
H  6.45177 -0.97897 0.299343
H  4.486445 2.51881 -1.373051
H  -6.55407 -0.181432 1.34365
H  6.593679 1.281897 -0.788546
