program: Gaussian 09
title: 000244502
version: EM64L-G09RevD.01
frameworkgroup: C1[X(C15H22O3)]
method: RPBEPBE
basis: SDD
operation: Freq
keyword: #pfreq=noraman
keyword: PBEPBE/SDD
title: #p freq=noraman PBEPBE/SDD
converged: YES YES NO NO
title: Mulliken charges:
elementType: O O O C C C C C C C C C C C C C C C H H H H H H H H H H H H H H H H H H H H H H
charge: -0.281673 -0.277379 -0.438130 -0.021812 0.028112 -0.273422 -0.439167 -0.325207 -0.354319 0.547959 -0.722209 -0.395961 -0.435614 -0.403493 -0.332455 -0.225724 -0.241853 -0.245799 0.212362 0.201510 0.226404 0.200806 0.211060 0.213814 0.207472 0.187088 0.232730 0.226958 0.251642 0.203588 0.212553 0.188730 0.231719 0.224919 0.188263 0.215645 0.222814 0.221926 0.226686 0.329457
chargesum: 0.00000
title: Mulliken charges with hydrogens summed into heavy atoms:
elementType: O O O C C C C C C C C C C C C C C C
charge: -0.281673 -0.277379 -0.108673 0.190550 0.229622 -0.047018 -0.027301 0.096079 0.065498 0.547959 -0.040021 0.005322 -0.203895 -0.178574 0.071454 -0.002910 -0.019927 -0.019113
polarizability: 1.65853698e+02 3.37885057e+00 1.90536889e+02 1.61516194e+01 1.57777172e+00 1.41795645e+02
1716.lowfreq: -12.7949 -9.6940 -2.3624 -0.0009 -0.0007 -0.0001 12.3713 17.2978 27.5690
frequency: 8.7514 17.2427 27.4150 41.7675 58.2001 72.1056 81.9063 94.4537 130.7608 136.4440 177.0030 204.6255 205.3107 221.6394 247.3323 286.5819 292.9326 318.5716 365.8701 403.5140 416.5896 437.1815 468.0289 486.1146 536.5494 585.7917 616.9124 629.6239 680.3561 702.5213 736.2029 765.1397 774.9494 783.2447 835.6990 848.3673 861.0079 893.1844 908.6257 917.9179 940.7176 949.5674 971.7398 975.4307 989.7607 991.4495 1001.0830 1011.6513 1027.7180 1033.5406 1043.9136 1063.8686 1069.5013 1077.9903 1082.3359 1100.6082 1103.7282 1135.1919 1161.7520 1171.5422 1177.3731 1189.2705 1208.6091 1230.1308 1241.7407 1249.0298 1264.6858 1278.8902 1285.4200 1291.7271 1293.4014 1312.4391 1317.9876 1334.6284 1339.6005 1355.1947 1364.5195 1377.4108 1382.9027 1385.0333 1392.1516 1441.2197 1446.6725 1464.4298 1470.2623 1473.8069 1481.9422 1483.9683 1485.3905 1486.7491 1593.1299 1613.7654 2929.3170 2944.9452 2951.0062 2957.2499 2969.8391 2976.7102 2989.5197 2991.7725 3014.9249 3015.2841 3029.3419 3052.7235 3063.9705 3073.3846 3082.7189 3102.4378 3115.2121 3119.7922 3132.6810 3142.9780 3160.9956 3558.9860
redmass: 3.8323 4.3915 3.8061 2.5275 2.6211 4.1737 3.5116 4.2180 2.5888 2.3218 3.7485 2.5436 2.0095 1.4484 4.6447 3.6471 4.0029 1.1878 3.6222 2.7944 3.7310 3.1591 4.0032 2.5486 3.1574 4.3448 6.4183 3.6908 7.7739 1.6787 1.1339 2.0351 3.2590 1.3445 2.3278 1.2535 3.0129 1.9571 1.6289 1.6007 4.7871 4.8806 1.4021 2.2224 5.4425 1.3245 2.2854 2.4994 2.6979 3.0355 2.6603 2.2296 2.5693 1.6109 2.1302 1.7863 1.8504 1.6698 1.7443 1.0562 1.5592 1.1103 1.9295 1.2742 1.2154 1.2591 1.4563 1.2373 1.0652 1.3635 1.3048 1.2635 1.1898 1.2884 1.3231 1.4021 1.5222 1.6462 1.5081 3.3351 1.2517 2.1514 1.0838 1.0717 1.1073 1.0858 1.0863 1.3085 1.5026 1.0945 5.9970 6.1600 1.0843 1.0845 1.0689 1.0630 1.0612 1.0619 1.0366 1.0592 1.0853 1.0929 1.0981 1.1017 1.1063 1.0985 1.0982 1.1006 1.0854 1.0868 1.0915 1.0962 1.1015 1.0661
irintensity: 0.0579 0.2510 2.0723 0.5787 7.5760 3.4961 0.9373 0.8156 1.9796 1.4414 0.9173 1.8872 1.1646 0.3943 0.2839 0.1015 12.2157 133.5677 8.7680 0.0714 5.8867 7.2911 9.4438 6.4214 30.6324 4.1270 0.2283 5.2266 3.3658 56.9842 4.6076 35.0491 6.1548 10.2249 14.9205 0.3446 28.6293 37.1359 19.0409 8.6285 38.5182 68.8567 0.3095 3.2545 1.7053 0.4283 18.7929 4.2573 80.7684 50.1752 103.1963 16.5872 14.3081 16.2649 11.4241 4.3418 19.6617 4.9152 5.0368 0.0657 1.4331 0.0786 2.8773 26.0616 2.5751 0.6751 5.2381 6.3370 0.3693 0.8254 0.6972 11.7071 6.9287 3.2864 1.5971 18.1476 3.7929 14.0537 9.2813 5.0111 28.7642 8.5595 4.3527 1.0801 5.1077 1.0236 3.5494 22.3004 13.0854 12.5504 1.4023 7.0674 50.4742 42.9542 53.7987 11.3927 17.2003 50.7316 31.1739 83.7966 19.7313 7.4380 8.8504 34.7060 48.4641 70.8435 34.9435 21.4760 8.2671 1.9010 16.6541 48.2453 22.4571 7.0679
temp: 298.150 k
press: 1.00000 atm
elementType: 8 8 8 6 6 6 6 6 6 6 6 6 6 6 6 6 6 6 1 1 1 1 1 1 1 1 1 1 1 1 1 1 1 1 1 1 1 1 1 1
symmnumber: 1
zpe: 892825.7 jmol-1
zpe.correction: 0.340059 hartree
zpe.thermalcorrener: 0.359156 hartree
zpe.thermalcorrenthalpy: 0.360100 hartree
zpe.thermalcorrgfe: 0.288148 hartree
zpe.sumelectzpe: -809.039942 hartree
zpe.sumelectthermal: -809.020845 hartree
zpe.sumelectthermalent: -809.019901 hartree
zpe.sumelectthermalfe: -809.091853 hartree
dipole: 0.3279 -0.9318 -0.3654
dipole: 1.0533
quadrupole: -129.3593 -107.0964 -100.7268
quadrupole: 11.8556 9.0949 -4.2831
quadrupole: -16.9651 5.2978 11.6673 11.8556 9.0949 -4.2831
hfenergy: -809.380001 hartree
pointgroup: C01 [X(C15H22O3)]
dipole: 0.2698257 -0.2757345 -0.1512743 debye
polarizability: 144.3213086|-14.3100696|180.9110082|10.9947975|13.1435275|172.9539152 unknown
InChI: InChI=1S/C15H22O3/c1-12(13-7-3-2-4-8-13)15-17-11-14(18-15)9-5-6-10-16/h2-4,7-8,12,14-16H,5-6,9-11H2,1H3
charge 0 multiplicity 1
40 atoms
O  -0.08908 -0.798357 -0.069712
O  1.322853 -2.676125 -0.208621
O  -5.367325 2.07894 -3.063951
C  -0.873588 -1.858765 -0.760235
C  0.961172 -1.510111 0.647889
C  2.181342 -0.595693 0.858953
C  -1.678085 -1.211808 -1.887914
C  0.234328 -2.846068 -1.202471
C  -2.747918 -0.22527 -1.369488
C  1.807368 0.612183 1.720441
C  3.358806 -1.413843 1.445799
C  -3.524676 0.467615 -2.511366
C  1.725887 1.903824 1.143018
C  1.524408 0.473367 3.104832
C  -4.591064 1.444772 -1.9844
C  1.379136 3.029895 1.923291
C  1.171424 1.59463 3.887909
C  1.09903 2.879333 3.300686
H  -1.549279 -2.3408 -0.019356
H  0.570929 -1.910982 1.611024
H  2.46834 -0.241005 -0.149254
H  -2.162087 -2.012103 -2.484663
H  -0.971996 -0.684875 -2.559676
H  -0.098355 -3.898792 -1.182924
H  0.623246 -2.59192 -2.20704
H  -3.462108 -0.768546 -0.71598
H  -2.250406 0.530807 -0.731829
H  4.248187 -0.770061 1.560981
H  3.607575 -2.25576 0.778299
H  3.113209 -1.828966 2.440746
H  -4.023247 -0.286921 -3.151545
H  -2.80965 1.017482 -3.160562
H  1.930832 2.024529 0.072521
H  1.586776 -0.51303 3.580712
H  -4.118466 2.212711 -1.333538
H  -5.348451 0.907528 -1.388293
H  1.326042 4.020981 1.458065
H  0.955597 1.468048 4.955157
H  0.82943 3.750236 3.908835
H  -4.746935 2.591917 -3.641442
