program: Gaussian 09
title: 000244501
version: EM64L-G09RevD.01
frameworkgroup: C1[X(C18H28O2)]
method: RPBEPBE
basis: SDD
operation: Freq
keyword: #pfreq=noraman
keyword: PBEPBE/SDD
title: #p freq=noraman PBEPBE/SDD
converged: YES YES NO NO
title: Mulliken charges:
elementType: O O C C C C C C C C C C C C C C C C C C H H H H H H H H H H H H H H H H H H H H H H H H H H H H
charge: -0.229805 -0.256525 0.383237 -0.483897 -0.433797 -0.418090 -0.399201 0.043590 -0.383205 -0.314692 -0.739606 -0.347428 0.528797 -0.716104 -0.699084 -0.451397 -0.384120 -0.229480 -0.245596 -0.248783 0.191240 0.204753 0.185937 0.237318 0.235262 0.188545 0.264972 0.190818 0.186643 0.201483 0.208259 0.221671 0.225669 0.213605 0.221238 0.193622 0.195035 0.202253 0.240384 0.228862 0.211402 0.210189 0.217686 0.226652 0.258047 0.220594 0.219763 0.223285
chargesum: 0.00000
title: Mulliken charges with hydrogens summed into heavy atoms:
elementType: O O C C C C C C C C C C C C C C C C C C
charge: -0.229805 -0.256525 0.383237 -0.087904 -0.010542 0.005717 0.056589 0.230233 0.026536 -0.093021 -0.079095 0.041229 0.528797 -0.044604 -0.059807 -0.224745 -0.126073 -0.008886 -0.025833 -0.025498
polarizability: 2.20074895e+02 -1.69822159e+01 1.90958502e+02 -1.23943189e+01 -6.42510435e+00 1.69660542e+02
1716.lowfreq: -8.8868 0.0001 0.0003 0.0006 4.8873 8.0568 20.2915 30.9908 40.9012
frequency: 19.9514 30.9330 40.8845 42.7383 53.8969 68.7649 91.9178 108.1537 129.6378 161.9525 174.1053 185.8510 211.0968 212.4673 229.2874 231.3521 253.9351 261.4147 282.9274 292.2989 307.7156 327.0950 372.6940 405.9784 412.8792 436.3633 460.5382 502.6073 503.5525 539.6764 555.7320 616.2655 640.5392 685.6059 705.1637 724.9394 728.0157 740.9304 764.5096 776.3688 788.5309 851.6462 863.2467 884.3977 891.4052 902.4880 920.2479 929.0029 935.2884 949.1401 956.8766 973.3469 985.7659 989.9658 991.8391 1005.3728 1016.9710 1026.4219 1030.4443 1043.3817 1059.1307 1065.9342 1074.6529 1080.3330 1100.5793 1107.0427 1119.0804 1167.5475 1170.0416 1178.4445 1184.1976 1189.6174 1213.4542 1220.6269 1229.5356 1260.3320 1274.4337 1284.6713 1290.6296 1293.6274 1303.8646 1311.5905 1322.0275 1337.6949 1340.6097 1346.6660 1350.8154 1359.6807 1361.7804 1368.9098 1385.7991 1390.0574 1390.7715 1392.5830 1442.4211 1449.9455 1456.6101 1464.4109 1466.9698 1470.8198 1474.4470 1477.7715 1479.0910 1479.6384 1484.2300 1486.3638 1487.8133 1490.2155 1592.9654 1614.1602 2856.3564 2915.4688 2924.0801 2948.9257 2961.6521 2971.2254 2972.7116 2978.5926 2983.5502 2983.9101 2994.1566 3002.5433 3005.9207 3037.4639 3043.1988 3068.8794 3071.0842 3071.9817 3073.4829 3076.0587 3077.4618 3079.9884 3101.8243 3112.6769 3121.2234 3135.5238 3153.0718 3166.2444
redmass: 4.0990 3.8157 3.4013 2.6160 1.9069 2.6482 3.6155 2.5939 2.2092 3.1074 2.7168 4.0246 1.8487 3.0416 1.2079 1.1224 3.2166 2.2344 2.2114 3.0098 3.3339 2.2692 2.1591 2.8209 3.5331 2.6374 3.0455 4.1132 4.0995 4.5921 3.2238 6.2855 4.4376 3.1818 1.5792 1.1358 2.8041 3.6619 1.2581 1.9601 1.2887 1.2547 2.8315 2.2064 1.7673 2.1506 1.5650 1.8940 1.8558 3.0188 3.8661 1.3938 2.3103 1.5410 2.6030 2.0641 1.6140 2.2771 2.0498 3.2247 2.8548 2.0841 2.3458 1.8866 2.0765 1.9627 2.0222 2.2081 1.0592 1.9187 2.1446 1.1287 1.3723 1.5774 1.3608 1.2767 1.3764 1.4072 1.2571 1.1244 1.4642 1.3347 1.1686 1.4582 1.4358 1.3305 1.5285 1.4881 1.4926 1.3883 2.3975 1.2161 1.2151 1.5086 2.1154 1.0770 1.0826 1.0717 1.0765 1.1105 1.0589 1.0438 1.0670 1.1231 1.0683 1.8547 1.0689 1.0628 5.9923 6.1439 1.0819 1.0687 1.0689 1.0602 1.0584 1.0588 1.0379 1.0372 1.0385 1.0645 1.0935 1.0829 1.1008 1.1038 1.0965 1.1006 1.0980 1.0992 1.0975 1.0977 1.0952 1.0946 1.1004 1.0860 1.0874 1.0932 1.0973 1.0978
irintensity: 0.0294 0.1611 0.1210 0.0358 0.0506 0.1238 0.5971 0.2447 0.4875 1.0042 0.3833 3.1031 0.6965 0.1990 0.2353 0.0348 3.9627 0.4854 0.6890 1.3307 1.1110 1.0149 1.7225 0.1515 1.9049 1.1290 1.0487 11.2394 5.6430 2.7134 15.2237 0.1675 0.8212 2.7439 71.5186 6.8594 6.4101 2.1555 12.8936 30.3604 7.2070 1.9809 50.5944 16.6817 12.6187 6.7971 4.4979 5.1700 5.1896 14.0500 16.5220 0.4797 2.6811 0.4181 1.5586 9.9196 6.9854 79.2142 7.3650 99.6292 3.3042 6.2141 31.2603 24.2427 15.1510 8.4673 22.4341 2.0629 0.1190 13.2670 9.0652 0.2379 3.9886 3.2453 0.5367 0.9258 3.7797 2.4759 5.3876 1.1920 1.1799 3.9223 1.3409 3.1318 10.9777 3.9335 1.6208 21.9097 0.8888 1.1496 7.4442 12.2175 17.2808 14.5294 8.0856 3.7037 5.9449 1.9724 9.2077 7.5279 5.4673 13.0543 10.7554 7.5239 16.6942 21.1623 11.8541 3.5831 0.7145 5.9306 85.2414 20.6565 113.6070 39.4652 9.7368 48.1008 45.5391 32.8996 38.0558 23.8668 22.5668 20.9508 0.9373 54.8399 0.2728 77.1313 43.9143 48.7144 31.9985 43.2524 58.4222 23.6925 22.0333 7.4855 2.0867 36.5043 39.1561 8.2224
temp: 298.150 k
press: 1.00000 atm
elementType: 8 8 6 6 6 6 6 6 6 6 6 6 6 6 6 6 6 6 6 6 1 1 1 1 1 1 1 1 1 1 1 1 1 1 1 1 1 1 1 1 1 1 1 1 1 1 1 1
symmnumber: 1
zpe: 1103318.3 jmol-1
zpe.correction: 0.420232 hartree
zpe.thermalcorrener: 0.441676 hartree
zpe.thermalcorrenthalpy: 0.442620 hartree
zpe.thermalcorrgfe: 0.368493 hartree
zpe.sumelectzpe: -851.578927 hartree
zpe.sumelectthermal: -851.557483 hartree
zpe.sumelectthermalent: -851.556538 hartree
zpe.sumelectthermalfe: -851.630665 hartree
dipole: 2.6487 -0.9281 0.4291
dipole: 2.8392
quadrupole: -121.1345 -117.6678 -122.5776
quadrupole: -1.8498 -1.6454 -3.1065
quadrupole: -0.6745 2.7922 -2.1177 -1.8498 -1.6454 -3.1065
hfenergy: -851.9991584 hartree
pointgroup: C01 [X(C18H28O2)]
dipole: 1.0473155 0.3726793 -0.1096363 debye
polarizability: 218.9316805|16.5943189|191.5120873|15.1750974|-4.743988|170.2501708 unknown
InChI: InChI=1S/C18H28O2/c1-4-6-12-18(5-2)13-19-17(20-14-18)15(3)16-10-8-7-9-11-16/h7-11,15,17H,4-6,12-14H2,1-3H3
charge 0 multiplicity 1
48 atoms
O  -0.408534 0.703193 -1.487639
O  -0.155677 1.16415 0.870154
C  1.769054 0.134258 -0.372105
C  3.304399 0.274606 -0.59407
C  1.055681 0.631571 -1.661029
C  1.316442 1.098536 0.762305
C  1.328121 -1.317176 -0.01379
C  -0.747195 1.605347 -0.392423
C  4.2063 -0.199751 0.569795
C  -2.281024 1.666904 -0.26379
C  1.727763 -2.409989 -1.02839
C  5.709742 -0.00761 0.263462
C  -2.936162 0.299853 -0.050793
C  -2.67963 2.687938 0.832476
C  6.622969 -0.48495 1.41294
C  -3.800401 -0.229542 -1.041491
C  -2.731085 -0.449844 1.13783
C  -4.448422 -1.472594 -0.85676
C  -3.374208 -1.693347 1.324503
C  -4.237818 -2.210196 0.33006
H  3.537429 1.340145 -0.809822
H  3.585444 -0.286719 -1.509267
H  1.442487 1.640557 -1.936221
H  1.213367 -0.051502 -2.510928
H  1.65517 0.757004 1.753869
H  1.715173 2.122083 0.571313
H  0.229441 -1.316198 0.106939
H  1.750761 -1.572699 0.97874
H  -0.328785 2.618521 -0.627395
H  3.95774 0.352922 1.498724
H  4.016622 -1.270697 0.782267
H  -2.627158 2.054582 -1.242164
H  1.269311 -2.238538 -2.019238
H  2.823475 -2.475751 -1.164907
H  1.377068 -3.398007 -0.67831
H  5.905753 1.063909 0.053206
H  5.963968 -0.557438 -0.666006
H  -2.243687 3.683921 0.62537
H  -2.321786 2.360523 1.822776
H  -3.777669 2.792573 0.875069
H  6.466118 -1.559689 1.623571
H  6.412661 0.07284 2.345118
H  7.69132 -0.341382 1.167831
H  -3.959801 0.333341 -1.969757
H  -2.051388 -0.064762 1.904075
H  -5.112249 -1.863463 -1.636686
H  -3.201714 -2.260914 2.246635
H  -4.738488 -3.174018 0.478254
