program: Gaussian 09
title: 000244500
version: EM64L-G09RevD.01
frameworkgroup: C1[X(C16H24O2)]
method: RPBEPBE
basis: SDD
operation: Freq
keyword: #pfreq=noraman
keyword: PBEPBE/SDD
title: #p freq=noraman PBEPBE/SDD
converged: YES YES NO NO
title: Mulliken charges:
elementType: O O C C C C C C C C C C C C C C C C H H H H H H H H H H H H H H H H H H H H H H H H
charge: -0.235582 -0.253346 0.347286 -0.419474 -0.408435 -0.390705 0.043260 -0.747696 -0.312797 -0.389464 0.528465 -0.716633 -0.691918 -0.450639 -0.383537 -0.229458 -0.245710 -0.248505 0.196620 0.188834 0.186502 0.237139 0.231974 0.186171 0.185808 0.199407 0.277190 0.209197 0.221851 0.209703 0.216255 0.229173 0.202163 0.240177 0.208893 0.210849 0.219287 0.226537 0.257558 0.220561 0.219757 0.223282
chargesum: 0.00000
title: Mulliken charges with hydrogens summed into heavy atoms:
elementType: O O C C C C C C C C C C C C C C C C
charge: -0.235582 -0.253346 0.347286 -0.034020 0.015206 0.027441 0.229068 -0.061902 -0.090946 0.036493 0.528465 -0.045121 -0.052889 -0.224102 -0.125980 -0.008897 -0.025953 -0.025223
polarizability: 1.92127330e+02 1.78306224e+01 1.68080948e+02 5.96513691e+00 -3.80965607e+00 1.56824124e+02
1716.lowfreq: -11.3039 0.0005 0.0006 0.0008 3.1437 9.2344 26.2849 31.8474 51.4247
frequency: 26.0980 31.6715 51.3887 63.0925 80.9166 94.5217 132.1295 171.7900 182.7206 205.8715 208.6807 219.8456 224.5562 233.2777 254.5255 281.4904 308.3216 316.8328 326.7073 405.3194 406.6828 407.0102 419.6369 480.4146 502.5991 542.5233 555.2866 615.6403 641.7084 680.7489 704.3739 737.0143 738.8830 769.2051 777.2425 850.6292 852.4421 861.7694 878.9183 901.1684 920.2066 928.7861 930.3418 950.5704 958.1779 961.9897 972.7301 989.2190 990.4774 996.5720 1005.7694 1029.5535 1037.8387 1054.1357 1066.3500 1075.3067 1098.0556 1107.1928 1118.7349 1170.1184 1171.7326 1180.6270 1190.7852 1194.3042 1218.2291 1229.7417 1250.0045 1282.7330 1289.9510 1302.7127 1304.6354 1319.6414 1326.3163 1342.0270 1347.4319 1355.9519 1357.5783 1363.3366 1385.2990 1386.7737 1392.3378 1393.2596 1442.5213 1449.9450 1453.9913 1464.5018 1470.9332 1471.0258 1476.6838 1477.5369 1479.2200 1485.5374 1486.4203 1488.5510 1592.8925 1613.8010 2856.1969 2912.4554 2921.9984 2941.9139 2972.3846 2978.9152 2980.2667 2983.6146 2992.1651 3002.6083 3035.4237 3065.2995 3070.6654 3071.6520 3073.4218 3075.6922 3082.2999 3094.5926 3101.6315 3114.1468 3121.8437 3136.0845 3153.5972 3167.2620
redmass: 4.1107 3.7391 3.5411 1.7500 2.8967 3.7221 2.7794 3.3643 2.7669 1.3890 1.4943 1.9700 1.8925 1.3478 3.3000 3.0221 3.4316 2.5597 2.4311 2.7155 2.4758 1.9162 3.8264 5.6468 4.0996 4.2593 3.3573 6.2870 4.3908 3.3078 1.5834 1.1521 3.7516 3.0535 2.2245 1.2776 1.5390 2.0582 2.2194 2.4948 1.6064 2.1371 1.5668 3.8533 1.7743 3.1100 1.3987 2.2830 1.8845 1.8462 2.1106 2.1446 2.6933 2.5333 2.0300 1.7629 2.1278 1.9602 2.0127 1.0659 2.1939 1.7946 1.1201 1.6071 1.8312 1.3077 1.5152 1.4073 1.2999 1.4780 1.5507 1.1918 1.4223 1.3249 1.4053 1.3596 1.4853 1.4838 2.0546 1.4237 1.2507 1.3672 2.1088 1.0819 1.0781 1.0786 1.0713 1.0921 1.0564 1.0424 1.1359 1.0758 1.8098 1.0699 6.0022 6.1044 1.0820 1.0683 1.0680 1.0595 1.0356 1.0536 1.0479 1.0377 1.0946 1.0830 1.1008 1.0962 1.1006 1.0979 1.0991 1.0976 1.0941 1.0988 1.1002 1.0852 1.0878 1.0934 1.0976 1.0974
irintensity: 0.0851 0.1442 0.2964 0.0271 0.3021 0.6707 0.4600 1.7441 0.6932 0.5493 1.0201 1.1126 0.5939 0.1405 3.8751 1.5056 0.3149 0.7395 2.3683 0.0839 1.2734 1.0883 3.1515 3.8382 12.7759 4.2306 12.6161 0.1575 0.9605 4.6298 70.3452 7.1884 1.6397 16.5760 22.7241 3.7588 12.6254 26.6651 13.1345 16.0310 11.1458 18.3911 0.2374 8.6431 31.4180 9.2874 0.3930 0.1732 1.5606 3.2341 6.1741 30.0239 158.4130 1.8735 5.5227 51.3717 19.3704 8.2974 20.8873 0.0971 2.2820 12.7337 0.6590 2.0933 3.3298 2.3196 1.5177 6.4617 0.3953 2.7060 1.0927 3.1158 8.6883 3.8298 6.6197 17.5859 2.8045 1.4722 5.0008 17.4456 7.4920 18.9755 8.1330 6.7390 1.8111 2.8074 4.4336 5.8994 12.3220 14.0678 6.8166 1.2347 20.5429 23.7433 0.7289 5.9805 84.4134 24.9599 103.0014 62.2930 49.5702 21.4033 27.3623 38.3459 20.6421 20.2952 14.2541 1.7705 101.2314 13.6423 51.4236 45.3128 33.9805 16.0083 21.8680 5.9201 2.7929 38.3916 39.2572 7.5443
temp: 298.150 k
press: 1.00000 atm
elementType: 8 8 6 6 6 6 6 6 6 6 6 6 6 6 6 6 6 6 1 1 1 1 1 1 1 1 1 1 1 1 1 1 1 1 1 1 1 1 1 1 1 1
symmnumber: 1
zpe: 956120.6 jmol-1
zpe.correction: 0.364167 hartree
zpe.thermalcorrener: 0.382848 hartree
zpe.thermalcorrenthalpy: 0.383792 hartree
zpe.thermalcorrgfe: 0.316768 hartree
zpe.sumelectzpe: -773.134620 hartree
zpe.sumelectthermal: -773.115939 hartree
zpe.sumelectthermalent: -773.114995 hartree
zpe.sumelectthermalfe: -773.182019 hartree
dipole: 2.7800 0.8847 -0.0806
dipole: 2.9185
quadrupole: -106.4354 -105.8387 -107.6108
quadrupole: 2.3499 1.9179 -2.6665
quadrupole: 0.1929 0.7896 -0.9825 2.3499 1.9179 -2.6665
hfenergy: -773.4987872 hartree
pointgroup: C01 [X(C16H24O2)]
dipole: 1.095347 -0.3438342 0.0206871 debye
polarizability: 191.8369157|-18.2979536|167.4735128|-5.8268186|-3.9649873|157.7219734 unknown
InChI: InChI=1S/C16H24O2/c1-4-10-16(3)11-17-15(18-12-16)13(2)14-8-6-5-7-9-14/h5-9,13,15H,4,10-12H2,1-3H3
charge 0 multiplicity 1
42 atoms
O  0.3591 -0.298617 1.280369
O  0.149964 -1.244349 -0.932634
C  2.238688 0.025556 -0.348258
C  3.785092 -0.078473 -0.495524
C  1.824158 -0.175914 1.13608
C  1.608104 -1.155221 -1.141531
C  -0.149285 -1.412565 0.490035
C  1.68679 1.36764 -0.885731
C  -1.672588 -1.506482 0.69998
C  4.615446 0.994879 0.248491
C  -2.423254 -0.222162 0.338563
C  -2.233015 -2.746425 -0.042728
C  6.131656 0.812635 0.018775
C  -3.087816 0.51342 1.35145
C  -2.505657 0.244907 -1.000003
C  -3.819174 1.683651 1.043946
C  -3.232768 1.415226 -1.310672
C  -3.89521 2.139392 -0.291546
H  4.035395 -0.028777 -1.576999
H  4.116732 -1.08144 -0.148172
H  2.313687 -1.091005 1.544549
H  2.095782 0.689494 1.760906
H  1.739074 -1.023639 -2.228855
H  2.080722 -2.115813 -0.830136
H  0.357435 -2.351837 0.83325
H  2.006573 1.530924 -1.932624
H  0.584341 1.368063 -0.852835
H  2.043611 2.221901 -0.282688
H  -1.793879 -1.669551 1.788946
H  4.40593 0.950315 1.335568
H  4.313022 2.00433 -0.089727
H  -3.311034 -2.860688 0.165238
H  -1.717312 -3.670346 0.281823
H  -2.096638 -2.647762 -1.132567
H  6.472935 -0.177573 0.375912
H  6.381115 0.884457 -1.056826
H  6.715956 1.583942 0.553033
H  -3.023911 0.171339 2.391949
H  -1.982099 -0.300247 -1.791145
H  -4.324541 2.237635 1.843606
H  -3.282654 1.76384 -2.349025
H  -4.461375 3.045837 -0.535243
