program: Gaussian 09
title: 000244499
version: EM64L-G09RevD.01
frameworkgroup: C1[X(C12H12Br2O4)]
method: RPBEPBE
basis: SDD
operation: Freq
keyword: #p
keyword: freq=noraman
keyword: PBEPBE/SDD
title: #p freq=noraman PBEPBE/SDD
converged: YES YES NO NO
title: Mulliken charges:
elementType: Br Br O O O O C C C C C C C C C C C C H H H H H H H H H H H H
charge: -0.031548 -0.010860 -0.240993 -0.283422 -0.229372 -0.255066 0.262448 0.110672 -0.369601 -0.323744 0.133374 0.204645 -0.215828 -0.218251 -0.254406 -0.246257 -0.648429 -0.657377 0.263500 0.276646 0.242106 0.240847 0.259283 0.259210 0.251753 0.260140 0.328629 0.282374 0.316881 0.292646
chargesum: 0.00000
title: Mulliken charges with hydrogens summed into heavy atoms:
elementType: Br Br O O O O C C C C C C C C C C C C
charge: -0.031548 -0.010860 -0.240993 -0.283422 -0.229372 -0.255066 0.262448 0.110672 -0.106102 -0.047098 0.133374 0.204645 0.026278 0.022595 0.264087 0.265636 -0.037426 -0.047850
polarizability: 2.44598235e+02 7.10554037e+00 1.69077771e+02 4.71020583e+00 2.19419308e+01 1.13460344e+02
1716.lowfreq: -8.1003 -3.8770 -0.0006 -0.0005 -0.0005 0.6070 15.6426 26.9034 31.8140
frequency: 15.4922 26.8789 31.7870 35.8500 43.0930 83.5466 87.2948 95.2425 106.1591 134.7441 154.6186 161.6207 191.5763 231.2046 280.4609 295.1204 310.8404 332.8983 372.3180 410.0926 422.4181 441.8474 505.9235 525.2732 546.8568 634.5212 642.6974 670.9140 674.6844 698.7270 738.1182 759.1216 783.6921 788.2341 801.7999 824.4176 900.3924 901.6779 927.0892 976.8810 979.1545 997.5308 1006.0987 1022.9791 1033.0683 1057.9069 1064.7326 1068.9086 1121.3419 1167.4554 1179.0149 1184.2182 1222.5906 1228.3551 1242.0133 1246.0749 1279.1765 1285.1255 1288.8364 1356.5712 1356.9252 1381.8475 1424.5152 1429.9091 1447.1893 1455.6950 1462.1691 1477.2581 1578.5738 1602.5630 1620.6342 1630.9968 2999.5840 3046.1782 3060.3716 3065.4896 3097.4231 3124.1003 3140.9777 3152.4682 3155.2255 3159.7222 3169.7414 3184.8780
redmass: 10.1057 14.1839 7.9837 8.6000 13.5939 6.0517 3.1224 3.5296 4.9259 7.1218 4.7230 5.8574 6.0532 6.0185 4.5557 5.1159 5.7472 4.1585 3.7586 5.9817 3.9398 3.5317 5.8999 4.3589 4.0419 5.7045 6.0541 6.1756 5.3767 4.8443 3.2978 2.8816 3.1024 1.5951 1.6111 3.0821 1.5843 5.0898 2.2998 1.4061 1.9646 1.2962 1.3538 4.4399 3.8888 2.3114 4.1798 3.4857 1.8649 1.2544 1.0683 1.3272 1.7905 1.7605 1.2134 2.7408 1.4829 1.1247 1.1714 1.2693 1.3260 10.8114 1.1135 2.1534 1.0946 1.1027 1.1010 2.6113 7.2018 6.4567 9.9406 10.8700 1.0621 1.0586 1.0578 1.0559 1.1008 1.1090 1.0865 1.1103 1.0914 1.1124 1.0972 1.0971
irintensity: 0.2788 0.1145 1.6645 0.3874 0.1730 3.8428 3.8288 1.1374 2.6912 2.0657 4.1413 2.3298 0.7898 6.9618 2.9593 7.3977 8.4179 17.5975 15.3950 12.7416 0.8210 9.8150 5.2197 12.5580 9.1843 15.5028 16.0977 20.2451 2.8935 59.3641 40.1722 8.4705 3.3568 35.7321 1.0331 7.7817 2.9136 22.3535 35.1005 4.8228 12.7268 6.5431 1.6303 179.1093 155.2344 15.6289 5.7905 242.5506 43.6371 19.3620 5.0272 22.8646 79.6384 59.8777 58.7177 312.2497 24.3899 22.5344 22.0671 21.0457 11.4435 11.3298 30.1188 4.1361 27.7817 18.5257 9.9584 18.8535 28.8955 26.7419 187.6199 139.4582 29.5845 17.4256 19.1072 8.5159 6.5888 6.5075 1.4380 0.4337 8.4871 3.8932 13.9623 8.0495
temp: 298.150 k
press: 1.00000 atm
elementType: 35 35 8 8 8 8 6 6 6 6 6 6 6 6 6 6 6 6 1 1 1 1 1 1 1 1 1 1 1 1
symmnumber: 1
zpe: 573141.1 jmol-1
zpe.correction: 0.218298 hartree
zpe.thermalcorrener: 0.236847 hartree
zpe.thermalcorrenthalpy: 0.237792 hartree
zpe.thermalcorrgfe: 0.166026 hartree
zpe.sumelectzpe: -790.966768 hartree
zpe.sumelectthermal: -790.948219 hartree
zpe.sumelectthermalent: -790.947274 hartree
zpe.sumelectthermalfe: -791.019040 hartree
dipole: -3.0144 -1.8387 -1.2941
dipole: 3.7606
quadrupole: -122.3711 -106.8181 -128.7729
quadrupole: 5.6155 10.1809 5.0145
quadrupole: -3.0504 12.5026 -9.4522 5.6155 10.1809 5.0145
hfenergy: -791.185066 hartree
pointgroup: C01 [X(C12H12Br2O4)]
dipole: -0.4832318 1.3659103 0.2996377 debye
polarizability: 214.6636866|-34.4437757|206.1491846|-6.5808976|5.2466426|106.3234797 unknown
InChI: InChI=1S/C12H12Br2O4/c13-5-7-17-11(15)9-3-1-2-4-10(9)12(16)18-8-6-14/h1-4H,5-8H2
charge 0 multiplicity 1
30 atoms
Br 0.766185 -3.57487 1.627902
Br 5.073248 -2.393106 -0.713678
O  -1.47623 -1.108752 0.869126
O  2.147146 0.691448 -0.634061
O  -3.060409 -0.596587 -0.777906
O  0.439763 -0.776646 -1.245778
C  -1.489187 1.1123 -0.016596
C  -0.111536 1.390886 -0.253477
C  -2.371955 2.172463 0.294887
C  0.362643 2.721658 -0.123234
C  -2.081205 -0.26819 -0.070954
C  0.800952 0.316305 -0.746252
C  -1.891501 3.494234 0.41697
C  -0.51863 3.767202 0.219348
C  -1.893263 -2.534872 0.849592
C  3.156511 -0.273122 -1.165346
C  -0.767606 -3.401431 0.306351
C  3.592272 -1.195889 -0.025947
H  -3.433014 1.951852 0.447909
H  1.420513 2.921079 -0.311322
H  -2.584966 4.304474 0.665221
H  -0.140635 4.790146 0.315801
H  -2.783469 -2.632395 0.197147
H  -2.155769 -2.791614 1.888054
H  3.985395 0.358918 -1.51865
H  2.71675 -0.845712 -1.998924
H  -0.322843 -2.971396 -0.602492
H  -1.107569 -4.435927 0.14437
H  2.789606 -1.86956 0.307554
H  4.025403 -0.641496 0.818881
