program: Gaussian 09
title: 000244495
version: EM64L-G09RevD.01
frameworkgroup: C1[X(C16H24O2)]
method: RPBEPBE
basis: SDD
operation: Freq
keyword: #pfreq=noraman
keyword: PBEPBE/SDD
title: #p freq=noraman PBEPBE/SDD
converged: YES YES NO NO
title: Mulliken charges:
elementType: O O C C C C C C C C C C C C C C C C H H H H H H H H H H H H H H H H H H H H H H H H
charge: -0.231502 -0.256149 0.371749 -0.421394 -0.413672 -0.390567 -0.444480 0.044222 -0.312992 -0.739647 -0.725171 0.528554 -0.715757 -0.451015 -0.383481 -0.229377 -0.245956 -0.248712 0.184072 0.235302 0.234992 0.187153 0.265939 0.190439 0.196168 0.211910 0.186919 0.222023 0.225592 0.213278 0.221874 0.229893 0.218871 0.221223 0.228908 0.202264 0.240281 0.226719 0.257696 0.220616 0.219868 0.223348
chargesum: 0.00000
title: Mulliken charges with hydrogens summed into heavy atoms:
elementType: O O C C C C C C C C C C C C C C C C
charge: -0.231502 -0.256149 0.371749 -0.002020 0.008473 0.065812 -0.036403 0.231141 -0.090969 -0.078903 -0.055184 0.528554 -0.044304 -0.224297 -0.125786 -0.008761 -0.026087 -0.025364
polarizability: 1.85407324e+02 -1.82057871e+01 1.72858288e+02 -1.05243012e+01 -5.53805254e+00 1.54120966e+02
1716.lowfreq: -11.6943 -6.0814 0.0003 0.0004 0.0008 7.3744 18.6846 34.0418 49.7604
frequency: 18.0287 34.0335 49.7471 76.3900 86.9828 102.2588 142.4200 174.0238 179.8603 202.2400 207.8681 218.9155 234.0568 242.5167 273.0186 293.0902 301.4497 319.7208 338.5136 392.6191 404.9425 427.3009 450.5612 499.9612 502.6354 523.9108 556.0878 612.4719 616.0212 675.3390 704.3131 723.0612 740.3908 756.7477 776.0198 786.7214 850.8478 863.3454 891.1410 910.9783 919.0755 922.1266 929.6422 952.1168 965.2756 972.9262 989.4733 990.7464 1002.0821 1005.9331 1018.0112 1029.8788 1038.9230 1055.8172 1064.5620 1070.0913 1074.5991 1106.6405 1119.2647 1165.9307 1170.1844 1177.6161 1191.1841 1193.4331 1216.2270 1224.8256 1258.5762 1283.8495 1286.7000 1302.0744 1310.7729 1319.2509 1340.9280 1341.3253 1349.1170 1352.7679 1357.6929 1366.7551 1386.1151 1390.6535 1393.2295 1394.9242 1442.7701 1449.3835 1460.4555 1465.5863 1469.2427 1473.9762 1479.4973 1480.9023 1486.1018 1486.4120 1489.7129 1491.7076 1592.9018 1614.2274 2856.3389 2915.5079 2924.3592 2959.9123 2978.0308 2980.8711 2984.3389 2985.1555 3003.1842 3010.6933 3043.1522 3070.9201 3071.6406 3073.5083 3076.4661 3078.4301 3083.2875 3083.9626 3103.2266 3113.8614 3121.9253 3135.8733 3152.7666 3165.3863
redmass: 3.9127 4.0519 3.6598 2.2110 2.5091 2.7399 2.5606 2.6890 4.9393 1.9008 1.1901 1.3894 2.2912 3.3945 1.8432 2.2713 2.6751 2.1897 3.2843 2.1637 2.8159 3.0444 3.1637 4.1561 4.0726 3.6434 3.2526 4.3858 6.2833 3.3246 1.6074 2.8268 3.6853 1.2624 2.0026 1.3011 1.2612 2.7903 2.6945 2.2700 1.7328 1.7795 2.1645 5.7925 2.0952 1.3938 2.1158 2.0547 1.7361 1.8946 1.7145 2.1070 2.3082 2.9521 2.1072 2.0496 2.2386 1.9369 2.0082 2.2206 1.0561 1.7938 1.1650 1.8414 1.5797 1.4085 1.4030 1.4169 1.1796 1.5220 1.4253 1.1928 1.3338 1.4939 1.3057 1.5324 1.4513 1.4663 2.6250 1.2186 1.4231 1.2023 2.1089 1.0798 1.0844 1.0630 1.0903 1.0784 1.0960 1.0472 1.6834 1.1597 1.0500 1.0606 5.9915 6.1079 1.0819 1.0687 1.0689 1.0612 1.0370 1.0605 1.0377 1.0400 1.0829 1.0979 1.0959 1.0977 1.0978 1.0997 1.0976 1.0960 1.0981 1.0942 1.1000 1.0853 1.0876 1.0933 1.0970 1.0983
irintensity: 0.0469 0.2401 0.2451 0.1443 0.1403 0.8774 0.1468 0.9678 3.4787 0.1927 0.1329 0.3663 0.5330 3.6485 1.1519 0.1928 1.2372 0.7102 2.4554 1.0743 0.1222 3.0126 0.7673 3.4105 13.6163 2.6197 14.5630 1.8124 0.1674 2.9440 67.4814 4.9503 1.8836 7.2615 35.8466 12.7960 2.5640 51.6177 21.0399 14.7379 3.7059 3.8691 10.7848 29.6581 2.8581 0.3887 0.1177 2.3873 9.8724 5.6077 40.6339 12.6363 73.1747 20.7684 37.0233 46.6022 10.0701 6.6042 21.6372 3.1841 0.1454 14.8642 2.0271 5.5501 4.6940 1.7773 6.8413 1.9625 4.6659 2.5960 4.5769 0.8398 2.4763 14.2724 2.0134 0.3229 17.1293 1.1789 6.5059 17.1450 15.3567 17.5802 7.9788 5.6455 7.2263 2.4899 8.2549 28.0026 7.8143 4.1441 33.0866 1.7052 10.2490 1.4520 0.7221 5.8255 87.1035 21.0905 122.4608 56.6981 33.2275 5.9162 38.2389 40.8079 20.9726 26.7810 0.1636 11.8978 41.7214 67.9466 39.3318 49.1447 17.2015 48.7311 21.5732 6.1026 2.4924 37.2335 38.0140 9.0329
temp: 298.150 k
press: 1.00000 atm
elementType: 8 8 6 6 6 6 6 6 6 6 6 6 6 6 6 6 6 6 1 1 1 1 1 1 1 1 1 1 1 1 1 1 1 1 1 1 1 1 1 1 1 1
symmnumber: 1
zpe: 957117.5 jmol-1
zpe.correction: 0.364547 hartree
zpe.thermalcorrener: 0.383102 hartree
zpe.thermalcorrenthalpy: 0.384046 hartree
zpe.thermalcorrgfe: 0.317378 hartree
zpe.sumelectzpe: -773.132590 hartree
zpe.sumelectthermal: -773.114035 hartree
zpe.sumelectthermalent: -773.113091 hartree
zpe.sumelectthermalfe: -773.179759 hartree
dipole: 2.6269 -0.8112 0.2513
dipole: 2.7608
quadrupole: -104.8283 -105.3476 -108.7963
quadrupole: -2.8924 -1.6275 -3.1607
quadrupole: 1.4957 0.9765 -2.4722 -2.8924 -1.6275 -3.1607
hfenergy: -773.4971369 hartree
pointgroup: C01 [X(C16H24O2)]
dipole: 1.0387302 -0.3137784 0.048742 debye
polarizability: 184.0992416|-19.0292548|172.289706|-11.5093684|-5.2061734|155.99763 unknown
InChI: InChI=1S/C16H24O2/c1-4-16(5-2)11-17-15(18-12-16)13(3)14-9-7-6-8-10-14/h6-10,13,15H,4-5,11-12H2,1-3H3
charge 0 multiplicity 1
42 atoms
O  0.484688 -0.474153 1.431562
O  0.497895 -1.246871 -0.858008
C  2.484211 0.02806 -0.003039
C  1.952493 -0.314383 1.417179
C  1.966306 -1.106427 -0.933057
C  1.91685 1.393001 -0.496876
C  4.040837 -0.008503 0.050073
C  0.074986 -1.530326 0.513211
C  -1.458732 -1.66495 0.573493
C  2.358865 2.63542 0.305937
C  4.762649 0.330919 -1.27391
C  -2.20233 -0.365208 0.255903
C  -1.921026 -2.842671 -0.322308
C  -2.973229 0.269499 1.261709
C  -2.172598 0.215569 -1.039721
C  -3.699211 1.451565 0.988671
C  -2.893952 1.398047 -1.315457
C  -3.662661 2.021086 -0.304186
H  2.428571 -1.256268 1.777186
H  2.162343 0.488473 2.141688
H  2.17438 -0.896245 -1.994705
H  2.441969 -2.074776 -0.65129
H  0.813668 1.3248 -0.483874
H  2.20657 1.526845 -1.55872
H  4.359946 -1.018197 0.385268
H  4.384411 0.694105 0.835766
H  0.568972 -2.485663 0.829485
H  -1.674285 -1.924643 1.628593
H  2.034305 2.580221 1.361011
H  3.455805 2.776474 0.291988
H  1.902155 3.545466 -0.124046
H  4.519708 1.351737 -1.618569
H  5.858359 0.275892 -1.139314
H  4.493971 -0.372144 -2.083353
H  -3.01032 -2.992005 -0.224664
H  -1.414349 -3.78342 -0.033989
H  -1.689509 -2.64416 -1.382083
H  -2.997645 -0.161602 2.270341
H  -1.566862 -0.251394 -1.822331
H  -4.288336 1.926078 1.782065
H  -2.85676 1.834858 -2.320459
H  -4.224304 2.937091 -0.521069
