program: Gaussian 09
title: 000244494
version: EM64L-G09RevD.01
frameworkgroup: C1[X(C8H5BrCl2O2)]
method: RPBEPBE
basis: SDD
operation: Freq
keyword: #p
keyword: freq=noraman
keyword: PBEPBE/SDD
title: #p freq=noraman PBEPBE/SDD
converged: YES YES NO NO
title: Mulliken charges:
elementType: Br Cl Cl O O C C C C C C C C H H H H H
charge: 0.029666 0.053548 0.066829 -0.281684 -0.169181 0.374884 -0.295739 -0.379035 -0.156330 -0.146218 -0.232215 0.394548 -0.706702 0.308295 0.266648 0.257374 0.259445 0.355867
chargesum: 0.00000
title: Mulliken charges with hydrogens summed into heavy atoms:
elementType: Br Cl Cl O O C C C C C C C C
charge: 0.029666 0.053548 0.066829 -0.281684 -0.169181 0.374884 0.012556 -0.112387 0.101044 0.113226 -0.232215 0.394548 -0.350834
polarizability: 2.22201233e+02 5.64687706e+00 9.86658915e+01 -3.40694756e-01 -1.16647584e+01 7.96649013e+01
1716.lowfreq: -7.1839 -0.0008 0.0013 0.0020 0.8237 3.8974 9.6363 28.9012 47.3613
frequency: 8.9501 28.6537 47.3431 79.5364 123.7459 152.1948 191.7425 205.5081 245.4367 291.1265 337.1200 338.3029 360.0013 411.7832 504.3639 575.4873 599.5750 613.6712 694.4033 700.7610 718.4320 736.7360 778.0816 824.8304 840.0377 915.1771 957.8028 976.2944 992.2693 1056.2463 1075.1259 1111.7625 1151.8096 1192.4615 1196.6457 1250.9753 1290.9921 1369.5822 1395.0575 1461.3671 1576.7156 1594.4830 1662.7590 3158.6093 3164.4028 3171.1818 3183.2085 3211.9840
redmass: 15.9820 5.8410 9.9153 12.9999 12.3383 24.6643 12.0181 9.8768 16.8437 12.8388 7.7475 7.3024 7.6041 2.9821 2.9366 9.6924 11.8168 7.3509 8.7422 3.8283 7.3626 9.4461 7.6747 1.2862 1.4468 7.3402 1.3411 1.3375 5.0864 2.7540 2.6331 1.3264 2.7228 1.3852 1.0675 1.5579 1.2467 7.6474 3.3177 2.2485 6.9457 7.2148 11.4180 1.0891 1.0889 1.0918 1.0978 1.0950
irintensity: 0.0945 0.1930 0.3883 0.9271 0.1654 0.0687 0.8764 1.7310 0.6998 6.6682 2.8988 0.8759 14.5390 0.0262 30.3054 6.2182 69.8119 4.6949 16.4430 0.0306 53.4595 62.3815 3.5824 10.7131 84.2232 53.8481 2.4584 1.3819 94.5853 156.7893 193.0061 13.3827 160.4721 57.3960 9.0239 47.6494 0.6334 3.3629 8.7952 167.7844 0.4082 5.4389 215.1246 0.8339 1.6447 2.0411 1.2903 5.4910
temp: 298.150 k
press: 1.00000 atm
elementType: 35 17 17 8 8 6 6 6 6 6 6 6 6 1 1 1 1 1
symmnumber: 1
zpe: 290242.4 jmol-1
zpe.correction: 0.110547 hartree
zpe.thermalcorrener: 0.123306 hartree
zpe.thermalcorrenthalpy: 0.124250 hartree
zpe.thermalcorrgfe: 0.066292 hartree
zpe.sumelectzpe: -1390.923449 hartree
zpe.sumelectthermal: -1390.910691 hartree
zpe.sumelectthermalent: -1390.909747 hartree
zpe.sumelectthermalfe: -1390.967705 hartree
dipole: 1.1378 1.6715 -1.6548
dipole: 2.6128
quadrupole: -109.1833 -95.8803 -97.1809
quadrupole: -3.7856 4.3141 -4.0889
quadrupole: -8.4351 4.8679 3.5673 -3.7856 4.3141 -4.0889
hfenergy: -1391.0339966 hartree
pointgroup: C01 [X(C8H5Br1Cl2O2)]
dipole: 0.4129258 -0.8890089 0.3096375 debye
dipolederiv: -0.8088578 -0.0018856 0.0389855 -0.0295276 -0.0514446 0.0072158 0.0502924 0.0058439 -0.0246226 -0.3603584 -0.0652878 -0.1701804 -0.0529097 -0.1223555 -0.084882 -0.1694983 -0.1467398 -0.5690239 -0.3864426 0.1229734 0.2496153 0.1385169 -0.1897296 -0.2271941 0.1730238 -0.1529157 -0.3876258 -2.0017682 0.4089433 -0.0174646 0.6241301 -0.5999113 0.0748042 -0.0403671 0.0676726 -0.1835977 -0.6194204 -0.1082772 0.0139984 0.530326 -0.8424037 0.06985 -0.1037304 0.1181408 -0.2671627 1.179724 -0.1199238 -0.0239783 0.0582704 0.1003064 0.0027059 -0.073389 0.0088542 0.1112134 -0.153262 -0.0262707 0.0036596 0.0664094 -0.0917391 -0.0086676 -0.0146263 -0.0043943 -0.1255232 -0.1215474 0.0662248 -0.0167405 -0.0387448 0.0056712 -0.0298958 0.0091689 -0.0298013 -0.1426221 -0.4332947 0.0999745 -0.0034565 0.0755634 0.0565484 -0.0274026 0.0061432 -0.0327549 -0.0806897 -0.366202 -0.1035735 0.0314372 -0.1058049 0.045743 -0.0200722 0.0349499 -0.018469 -0.0853674 1.4002587 0.0323317 -0.0870536 0.0357421 -0.0028979 -0.0266086 -0.0942171 -0.0256358 -0.123099 1.7423141 -0.2056888 0.0649839 -1.0821611 1.2438556 -0.1767917 0.2751168 -0.2151325 0.1292259 0.6465512 -0.1490623 -0.0958358 -0.1907409 0.3165517 0.3524289 -0.0830618 0.3360159 1.1144472 0.1302276 0.0424551 -0.0018916 0.0222136 0.0826408 0.0184363 0.0013756 0.0160913 0.1805916 0.0517855 -0.0667414 0.0199959 -0.0642315 0.0236538 0.031218 0.0181956 0.0310614 0.1692761 0.0487417 -0.0505345 0.0149798 -0.0581521 0.0065212 0.031017 0.0171518 0.0306852 0.1522052 0.0421344 0.0698 -0.0071704 0.0647319 0.010862 0.0246093 -0.00561 0.0238224 0.1578931 0.0094164 0.0545428 -0.0138837 0.0063687 0.0081276 -0.0107709 -0.000918 -0.0123444 -0.0255182 unknown
polarizability: 221.2753679|-10.8392744|104.9665857|-5.3005061|-0.1107324|74.2900723 unknown
InChI: InChI=1S/C8H5BrCl2O2/c9-5-1-3-6(4-2-5)13-8(12)7(10)11/h1-4,7H
charge 0 multiplicity 1
18 atoms
Br 5.169371 0.013542 -0.118067
Cl -4.054801 -0.309595 -1.405059
Cl -4.421266 0.866127 1.404931
O  -0.979315 -0.40012 0.309862
O  -1.763284 1.796428 -0.079112
C  0.432199 -0.18504 0.187468
C  1.049184 1.058818 -0.077898
C  1.188276 -1.364092 0.363584
C  2.459575 1.105071 -0.166757
C  2.593733 -1.310617 0.274045
C  3.215658 -0.071004 0.008791
C  -1.954994 0.591888 0.149514
C  -3.307455 -0.10824 0.296363
H  0.45958 1.965817 -0.212204
H  0.67396 -2.307673 0.565923
H  2.955014 2.058015 -0.371567
H  3.188638 -2.217909 0.407963
H  -3.209675 -1.114513 0.716222
