program: Gaussian 09
title: 000244493
version: EM64L-G09RevD.01
frameworkgroup: C1[X(C15H22O2)]
method: RPBEPBE
basis: SDD
operation: Freq
keyword: #pfreq=noraman
keyword: PBEPBE/SDD
title: #p freq=noraman PBEPBE/SDD
converged: YES YES NO NO
title: Mulliken charges:
elementType: O O C C C C C C C C C C C C C C C H H H H H H H H H H H H H H H H H H H H H H
charge: -0.235415 -0.254182 0.337092 -0.402228 -0.381422 -0.408896 0.044597 -0.739116 -0.311876 -0.723084 0.528712 -0.716185 -0.450792 -0.383805 -0.229320 -0.245412 -0.248535 0.185521 0.236414 0.230522 0.184495 0.203528 0.195781 0.185726 0.198967 0.276963 0.209819 0.221825 0.222487 0.219196 0.228940 0.229219 0.202147 0.240283 0.226519 0.257797 0.220604 0.219785 0.223328
chargesum: 0.00000
title: Mulliken charges with hydrogens summed into heavy atoms:
elementType: O O C C C C C C C C C C C C C C C
charge: -0.235415 -0.254182 0.337092 0.019708 0.033595 -0.009587 0.230322 -0.053367 -0.090051 -0.052461 0.528712 -0.044535 -0.224273 -0.126008 -0.008717 -0.025626 -0.025207
polarizability: 1.76810451e+02 -1.79217546e+01 1.57593289e+02 6.24849156e+00 4.43115341e+00 1.48237959e+02
1716.lowfreq: -12.4426 -0.0008 -0.0007 -0.0006 3.9600 7.9937 23.2531 36.6457 56.3913
frequency: 22.8965 36.4620 56.3875 73.6325 105.3149 139.2934 180.0102 186.6025 202.9324 213.6399 218.2691 233.7845 247.1982 274.4245 300.5664 319.9854 334.4153 395.4263 405.3653 407.3021 422.0528 480.2779 503.2313 524.7539 555.4428 611.4834 615.3458 673.5196 704.3475 738.1987 765.8777 773.1686 777.4519 850.3781 860.7039 878.7752 905.1601 921.2914 924.2481 937.3394 951.8593 956.6266 972.4617 979.0419 989.5806 991.1689 1004.8837 1016.2207 1029.6017 1040.9336 1064.8465 1065.9255 1070.4725 1106.5270 1119.2766 1170.1469 1172.7017 1185.4110 1191.4088 1200.2358 1219.3321 1238.6455 1265.4269 1287.0796 1304.3996 1319.2149 1325.7945 1337.6443 1345.4531 1349.7726 1357.9558 1362.7174 1385.3446 1387.0008 1393.4534 1396.1456 1442.7179 1447.6468 1455.0636 1467.2168 1471.9356 1472.2756 1479.4306 1481.6313 1486.1625 1487.0758 1495.5755 1592.6070 1613.8277 2857.0759 2912.7609 2922.9774 2954.2673 2979.3760 2984.8330 2985.5306 3002.5534 3004.9070 3065.4237 3070.9765 3073.4890 3076.9658 3083.7523 3086.7695 3095.5704 3102.3179 3113.9554 3121.7782 3135.7951 3152.8281 3165.7456
redmass: 3.8338 3.9752 3.5366 2.2949 3.5918 2.5414 2.8594 1.6998 2.0860 1.3934 2.1339 2.1540 2.3699 1.5388 3.4952 2.2491 2.6248 2.2332 2.7945 2.0982 3.6203 5.3909 4.1216 3.4554 3.3934 4.6691 6.2639 3.4248 1.6048 4.2061 2.4680 1.3354 2.1327 1.2583 2.7840 2.2586 2.2804 1.7330 1.6935 2.3654 2.6133 2.7232 1.3927 2.0226 1.9234 2.2132 2.1601 1.7883 2.0773 2.2337 2.2201 1.8510 2.2389 1.9460 2.0055 1.0583 2.2374 1.7231 1.1251 1.4984 1.8517 1.3817 1.5506 1.4493 1.5934 1.1929 1.5315 1.3747 1.4711 1.3085 1.3564 1.5124 2.2313 1.3770 1.4018 1.1997 2.0958 1.0852 1.0775 1.0672 1.1148 1.0663 1.1245 1.0488 1.8084 1.0665 1.0505 5.9974 6.1002 1.0818 1.0684 1.0682 1.0595 1.0371 1.0375 1.0366 1.0828 1.0999 1.0961 1.0979 1.0984 1.0978 1.0949 1.0989 1.0986 1.1002 1.0851 1.0877 1.0934 1.0972 1.0980
irintensity: 0.0771 0.2609 0.5043 0.1353 0.9794 0.3711 0.1943 1.3905 2.3685 0.1369 0.7983 0.4182 4.0759 0.7373 1.4159 0.8601 1.9323 0.8150 0.1954 0.5915 2.8869 4.3735 12.8123 3.4670 12.0714 3.6636 0.1362 3.9137 67.4181 0.7672 16.3108 12.5468 18.7177 2.1142 48.1605 15.7887 9.9899 2.4394 3.7178 15.7943 39.9608 2.4659 0.5594 3.2068 0.0790 2.6486 14.5205 54.1661 12.4308 87.3220 11.5593 30.9158 63.8001 6.3858 20.6996 0.1002 0.8293 11.1599 0.3495 4.5906 3.8552 0.9584 8.5441 1.8402 1.4032 2.2049 11.5794 2.4654 3.3251 6.4121 15.4497 2.3764 5.0074 11.0132 15.3350 21.5836 7.7754 6.8594 2.9526 3.4771 7.4509 8.2557 7.0870 15.0349 18.4163 23.2262 5.0384 0.7386 5.9514 84.2853 25.9793 121.4612 59.2412 22.3051 40.9227 28.1944 18.6801 26.4691 3.7919 27.8268 66.7206 42.3669 37.1873 36.8883 13.5484 21.6546 5.6887 2.7544 38.2843 38.3759 8.5090
temp: 298.150 k
press: 1.00000 atm
elementType: 8 8 6 6 6 6 6 6 6 6 6 6 6 6 6 6 6 1 1 1 1 1 1 1 1 1 1 1 1 1 1 1 1 1 1 1 1 1 1
symmnumber: 1
zpe: 883289.6 jmol-1
zpe.correction: 0.336427 hartree
zpe.thermalcorrener: 0.353640 hartree
zpe.thermalcorrenthalpy: 0.354584 hartree
zpe.thermalcorrgfe: 0.291174 hartree
zpe.sumelectzpe: -733.911402 hartree
zpe.sumelectthermal: -733.894190 hartree
zpe.sumelectthermalent: -733.893246 hartree
zpe.sumelectthermalfe: -733.956656 hartree
dipole: -2.8096 0.7824 0.0729
dipole: 2.9174
quadrupole: -97.0903 -99.8499 -101.3865
quadrupole: -2.7605 1.9987 2.8585
quadrupole: 2.3519 -0.4076 -1.9443 -2.7605 1.9987 2.8585
hfenergy: -734.2478295 hartree
pointgroup: C01 [X(C15H22O2)]
dipole: 1.1084673 -0.2978728 0.0066713 debye
polarizability: 176.5859561|-18.4329844|156.6181481|-5.9385847|-4.3753019|149.4375934 unknown
InChI: InChI=1S/C15H22O2/c1-4-15(3)10-16-14(17-11-15)12(2)13-8-6-5-7-9-13/h5-9,12,14H,4,10-11H2,1-3H3
charge 0 multiplicity 1
39 atoms
O  0.741013 -0.214474 1.278181
O  0.598993 -1.150601 -0.94443
C  2.599985 0.245749 -0.340729
C  2.195852 0.002789 1.140249
C  2.04857 -0.965073 -1.147286
C  4.150606 0.240898 -0.485129
C  0.307499 -1.351427 0.475774
C  1.966296 1.555807 -0.864757
C  -1.206401 -1.54781 0.681408
C  4.89894 1.3634 0.268959
C  -2.041664 -0.313333 0.332572
C  -1.683044 -2.814252 -0.075132
C  -2.759943 0.36084 1.351534
C  -2.150991 0.164446 -1.000341
C  -3.570198 1.480952 1.055427
C  -2.956919 1.28503 -1.299508
C  -3.672614 1.947643 -0.274485
H  2.741571 -0.883537 1.540895
H  2.410019 0.87704 1.775154
H  2.174236 -0.814402 -2.232805
H  2.581202 -1.896349 -0.843413
H  4.396038 0.309833 -1.565388
H  4.539987 -0.741291 -0.142133
H  0.873504 -2.259051 0.811598
H  2.264798 1.743122 -1.913966
H  0.86604 1.492251 -0.820576
H  2.280194 2.425231 -0.259409
H  -1.317583 -1.730226 1.768397
H  4.725644 1.31361 1.359397
H  5.988372 1.275958 0.103975
H  4.589714 2.364867 -0.078501
H  -2.751272 -3.001717 0.130286
H  -1.107613 -3.705512 0.240039
H  -1.553284 -2.694975 -1.163691
H  -2.676857 0.010271 2.38785
H  -1.587151 -0.332331 -1.79571
H  -4.116228 1.987689 1.859683
H  -3.026931 1.642985 -2.333505
H  -4.299779 2.815449 -0.509288
