program: Gaussian 09
title: 000244479
version: EM64L-G09RevD.01
frameworkgroup: C1[X(C12H16O4)]
method: RPBEPBE
basis: SDD
operation: Freq
keyword: #pfreq=noraman
keyword: PBEPBE/SDD
title: #p freq=noraman PBEPBE/SDD
converged: YES YES NO NO
title: Mulliken charges:
elementType: O O O O C C C C C C C C C C C C H H H H H H H H H H H H H H H H
charge: -0.225856 -0.268636 -0.252809 -0.241643 -0.385826 -0.290714 -0.260995 -0.429528 0.246738 0.388421 -0.344344 -0.378538 -0.498483 -0.230749 -0.194057 -0.257848 0.243812 0.233180 0.227699 0.227269 0.184328 0.191180 0.259732 0.235919 0.247985 0.252196 0.236077 0.200594 0.202635 0.225562 0.228241 0.228456
chargesum: 0.00000
title: Mulliken charges with hydrogens summed into heavy atoms:
elementType: O O O O C C C C C C C C C C C C
charge: -0.225856 -0.268636 -0.252809 -0.241643 0.091167 0.164254 0.114513 0.066123 0.246738 0.388421 -0.096359 -0.126341 0.140823 -0.005187 0.034184 -0.029392
polarizability: 1.65438072e+02 2.40142303e+01 1.24852809e+02 3.84718149e-01 5.71550638e-01 1.29330464e+02
1716.lowfreq: -16.5792 -8.2458 -5.6280 0.0003 0.0005 0.0007 10.5015 22.3949 33.1406
frequency: 9.8362 22.3113 33.1196 46.7405 53.8131 68.6485 86.6512 117.2735 139.5307 159.4986 226.3888 240.2109 244.3718 278.1170 332.0506 343.8390 386.0448 410.9669 484.4039 492.4363 503.6231 551.8017 559.8138 611.2846 677.5472 693.3743 755.6898 758.3751 770.1739 796.6148 824.9119 878.7513 888.8821 892.0674 954.2170 962.3500 982.2337 983.2756 1003.5423 1009.1412 1025.8722 1053.0446 1068.8155 1083.5187 1085.6143 1109.8836 1143.3952 1159.2509 1166.1766 1178.9615 1184.6452 1196.3958 1220.4948 1249.1380 1271.7511 1285.6622 1288.0729 1314.4282 1344.1246 1374.4858 1388.2973 1390.4062 1439.3947 1441.3370 1450.8292 1458.7338 1459.2034 1468.1786 1476.9225 1479.2523 1494.1427 1593.5430 1610.7714 1625.1812 2903.9932 2925.8605 2950.8529 2997.7890 3006.8177 3017.4089 3025.8139 3078.4159 3079.3732 3105.7011 3108.5131 3128.9199 3137.6349 3153.0178 3162.7406 3173.6140
redmass: 5.1573 4.6561 4.5427 4.1884 2.4279 5.1310 2.6920 2.2290 4.7950 4.2826 1.2006 3.4885 4.5316 3.4916 4.5649 3.4481 5.2512 2.9392 3.5912 4.2976 3.0978 4.9558 5.2540 6.4219 4.5261 2.2104 2.6860 2.1071 2.1986 1.5616 1.2467 2.8002 1.6991 1.4399 6.8472 1.3651 4.5637 1.3903 2.7991 3.6005 2.2240 4.2759 3.0096 2.8100 2.0622 1.2649 1.6200 1.5045 1.1357 1.6528 1.5782 1.2503 4.3729 1.2335 1.1530 1.1613 1.2373 1.3281 1.2569 1.2941 8.0874 1.4080 1.1635 1.9119 1.1937 1.0513 1.0983 1.0616 2.2533 1.0793 1.0828 6.3573 6.3840 9.4437 1.0534 1.0354 1.1056 1.1027 1.0600 1.0602 1.0579 1.1020 1.1037 1.0970 1.1076 1.0848 1.0887 1.0927 1.0961 1.1004
irintensity: 0.4294 0.4619 1.4711 0.1975 5.6562 2.0326 0.3929 3.4999 2.7043 0.1276 4.4417 2.6260 1.2804 12.2891 5.7832 11.9524 14.0206 0.1050 0.4930 4.7450 8.9574 7.7945 13.3632 2.3777 29.7329 20.8410 57.4606 50.1770 20.0126 2.0282 0.1774 9.7298 4.0367 10.2812 105.4383 0.5868 1.2678 0.4686 35.0498 18.1259 50.3690 45.7194 2.2932 68.7286 27.6519 0.4418 5.1597 1.4363 24.1946 128.6267 94.5486 4.3389 175.1843 77.5005 0.9256 13.4762 7.3072 1.9162 5.6431 1.7794 8.9667 22.6291 1.5315 3.0016 14.7247 13.2410 5.9257 14.1589 94.4121 5.6716 7.2609 23.0912 66.7117 153.0647 54.3332 100.3097 63.9906 72.5896 29.1109 1.1766 39.4943 8.4607 5.2849 30.5296 24.8932 2.6579 9.8951 29.8208 18.9740 7.6830
temp: 298.150 k
press: 1.00000 atm
elementType: 8 8 8 8 6 6 6 6 6 6 6 6 6 6 6 6 1 1 1 1 1 1 1 1 1 1 1 1 1 1 1 1
symmnumber: 1
zpe: 680497.6 jmol-1
zpe.correction: 0.259188 hartree
zpe.thermalcorrener: 0.275990 hartree
zpe.thermalcorrenthalpy: 0.276935 hartree
zpe.thermalcorrgfe: 0.210115 hartree
zpe.sumelectzpe: -766.507159 hartree
zpe.sumelectthermal: -766.490356 hartree
zpe.sumelectthermalent: -766.489412 hartree
zpe.sumelectthermalfe: -766.556232 hartree
dipole: 1.0961 -2.2339 0.9769
dipole: 2.6732
quadrupole: -83.8385 -91.0688 -95.8270
quadrupole: -5.8828 2.6219 -3.5528
quadrupole: 6.4063 -0.8240 -5.5823 -5.8828 2.6219 -3.5528
hfenergy: -766.7663467 hartree
pointgroup: C01 [X(C12H16O4)]
dipole: -0.4346147 0.2780194 0.9164821 debye
polarizability: 165.149489|16.2188945|128.2318516|18.0345013|-1.9713712|126.2400045 unknown
InChI: InChI=1S/C12H16O4/c1-14-8-5-9-15-12(13)10-16-11-6-3-2-4-7-11/h2-4,6-7H,5,8-10H2,1H3
charge 0 multiplicity 1
32 atoms
O  -0.806603 -0.061766 -0.468693
O  -5.678588 0.285453 -0.241079
O  1.628156 -0.040777 -1.774085
O  -0.930682 -2.391131 -0.593947
C  -3.282376 0.063482 -0.323341
C  -1.972295 -0.039842 0.46877
C  -4.495826 0.150621 0.611527
C  0.77193 -1.208968 -1.907523
C  -0.395886 -1.303433 -0.914332
C  2.474263 0.032167 -0.646294
C  2.564281 -0.961625 0.358619
C  3.274825 1.197914 -0.581496
C  -6.915953 0.346909 0.534108
C  3.469693 -0.774347 1.430383
C  4.169832 1.368505 0.492566
C  4.274324 0.383117 1.505696
H  -3.398594 -0.820359 -0.97527
H  -3.262024 0.960624 -0.967452
H  -1.788559 0.852312 1.089339
H  -1.944382 -0.953752 1.089868
H  -4.41276 1.029706 1.292456
H  -4.577668 -0.765431 1.240924
H  0.346907 -1.126909 -2.923268
H  1.3427 -2.154688 -1.841459
H  1.951401 -1.868181 0.327742
H  3.178078 1.946802 -1.373422
H  -7.733136 0.450451 -0.196678
H  -6.924375 1.219983 1.22183
H  -7.070178 -0.57814 1.130326
H  3.540185 -1.54349 2.207828
H  4.78771 2.272156 0.539483
H  4.971599 0.518135 2.339078
