program: Gaussian 09
title: 000244478
version: EM64L-G09RevD.01
frameworkgroup: C1[X(C12H16O3)]
method: RPBEPBE
basis: SDD
operation: Freq
keyword: #pfreq=noraman
keyword: PBEPBE/SDD
title: #p freq=noraman PBEPBE/SDD
converged: YES YES NO NO
title: Mulliken charges:
elementType: O O O C C C C C C C C C C C C H H H H H H H H H H H H H H H H
charge: -0.251987 -0.268841 -0.244224 -0.388269 -0.295678 -0.261485 -0.651414 0.447420 0.283400 -0.363817 -0.409130 -0.220331 -0.221382 -0.241691 -0.498578 0.246486 0.227498 0.228459 0.220741 0.191674 0.182483 0.242217 0.237904 0.256571 0.233441 0.226490 0.226019 0.228463 0.235336 0.202488 0.199738
chargesum: 0.00000
title: Mulliken charges with hydrogens summed into heavy atoms:
elementType: O O O C C C C C C C C C C C C
charge: -0.251987 -0.268841 -0.244224 0.085715 0.153522 0.112672 -0.171293 0.447420 0.283400 -0.107246 -0.175689 0.006159 0.004637 -0.013229 0.138984
polarizability: 1.81184356e+02 1.01953538e+00 1.29544800e+02 1.71427401e+01 -1.76562246e+00 9.87688704e+01
1716.lowfreq: -19.1809 -4.0044 -0.0009 -0.0008 -0.0006 2.2572 7.8295 19.9189 26.4495
frequency: -1.1673 18.5112 26.2782 41.6624 53.1448 82.2745 101.4569 116.2229 158.3278 196.8772 221.1373 262.5037 299.2474 317.9419 341.0824 403.2997 420.8057 466.3654 488.5019 529.7259 611.4328 620.8812 696.2380 707.2130 746.7892 782.1305 800.1666 830.0664 852.8061 878.0151 888.4884 921.4568 935.5454 967.0203 976.5037 989.9270 995.6977 1027.2713 1052.6652 1068.6464 1076.7838 1084.4218 1105.9736 1110.4226 1143.5488 1158.7586 1172.3595 1189.1611 1198.1255 1202.5494 1227.1300 1272.2692 1283.2235 1286.0556 1288.7435 1332.2805 1372.8094 1383.7642 1390.2403 1438.5533 1440.6737 1454.5398 1457.1826 1457.9781 1468.0804 1478.1515 1483.2773 1493.4456 1594.9019 1611.0503 1638.7013 2902.3187 2924.9948 2949.4192 2996.4207 3015.2468 3019.6305 3023.7069 3076.3062 3099.2687 3103.6742 3104.6041 3121.3977 3127.4761 3139.1826 3149.2529 3164.5684
redmass: 4.3644 3.5773 4.5602 2.9109 3.8224 2.7921 5.3548 2.2708 3.9015 4.9902 1.2195 3.5052 5.4967 2.6790 3.4054 2.8108 3.1303 3.3132 4.2353 4.4014 5.3107 5.2508 3.9867 1.9196 1.9026 1.3336 2.7192 3.5874 1.2492 2.0863 2.0314 1.5638 2.2997 4.6163 1.3963 5.6489 1.3463 2.2330 4.3091 3.0286 1.8966 3.8588 1.8043 1.2668 1.6332 1.5030 1.0544 1.1290 1.2519 2.6807 1.6124 1.1548 1.2423 1.2739 1.3603 1.2791 1.3126 7.1075 1.4097 1.1610 2.0827 1.1326 1.0970 1.0513 1.0624 1.0773 2.2111 1.0822 6.1665 6.0966 9.0798 1.0536 1.0355 1.1055 1.1026 1.0598 1.0613 1.0574 1.1039 1.1008 1.1079 1.0970 1.0852 1.0875 1.0923 1.0966 1.1017
irintensity: 0.8057 0.8211 0.9706 3.0639 2.3935 0.7404 3.3210 3.2596 0.1900 0.9131 4.6515 7.0945 4.9566 4.2367 10.6250 0.1049 15.3887 4.7359 1.1387 13.9928 4.8762 6.5982 5.4702 54.6340 56.4807 5.0355 1.7630 3.3418 0.3108 6.1303 7.3008 3.6238 8.9850 102.5999 0.2550 2.6022 0.3218 8.0481 41.4734 2.8024 95.0759 72.2182 158.8804 1.3311 6.9678 4.3159 0.8287 2.0194 0.1138 1.5244 150.3050 0.0708 0.3537 34.0743 52.1378 13.7498 2.8332 3.8226 20.4892 1.4868 8.5613 16.6114 9.5767 12.2901 14.5661 5.0903 20.8805 7.2425 3.0014 16.6761 134.7856 55.4600 103.4197 63.9447 74.1093 4.3184 9.1176 46.6108 2.9581 4.7088 31.7095 31.4995 3.8025 0.4777 20.0961 34.0281 20.3328
temp: 298.150 k
press: 1.00000 atm
elementType: 8 8 8 6 6 6 6 6 6 6 6 6 6 6 6 1 1 1 1 1 1 1 1 1 1 1 1 1 1 1 1
symmnumber: 1
zpe: 670548.5 jmol-1
zpe.correction: 0.255398 hartree
zpe.thermalcorrener: 0.270320 hartree
zpe.thermalcorrenthalpy: 0.271264 hartree
zpe.thermalcorrgfe: 0.210099 hartree
zpe.sumelectzpe: -691.386619 hartree
zpe.sumelectthermal: -691.371698 hartree
zpe.sumelectthermalent: -691.370754 hartree
zpe.sumelectthermalfe: -691.431918 hartree
dipole: 0.7416 -1.3931 -1.6981
dipole: 2.3182
quadrupole: -73.9281 -88.8304 -87.7473
quadrupole: 0.5194 -7.2402 -0.3800
quadrupole: 9.5738 -5.3284 -4.2454 0.5194 -7.2402 -0.3800
hfenergy: -691.6420174 hartree
pointgroup: C01 [X(C12H16O3)]
dipole: -0.2795056 0.6080148 -0.6197232 debye
polarizability: 181.8726455|2.6263497|128.9510803|-15.1882906|4.6451636|98.6743014 unknown
InChI: InChI=1S/C12H16O3/c1-14-8-5-9-15-12(13)10-11-6-3-2-4-7-11/h2-4,6-7H,5,8-10H2,1H3
charge 0 multiplicity 1
31 atoms
O  -0.827009 0.763249 0.298139
O  -5.641769 -0.123184 0.259407
O  -0.386367 -1.52917 0.217017
C  -3.262356 0.260025 0.247734
C  -2.01221 0.564012 -0.589477
C  -4.508355 0.120582 -0.635904
C  1.099533 -0.024725 1.502978
C  2.403887 -0.027728 0.702147
C  -0.095107 -0.381498 0.624999
C  2.914846 -1.2370 0.164236
C  3.117016 1.177096 0.486928
C  4.12183 -1.239282 -0.569031
C  4.32649 1.175233 -0.246049
C  4.833244 -0.033607 -0.774903
C  -6.892429 -0.315668 -0.471241
H  -3.116687 -0.678752 0.810462
H  -3.431433 1.071146 0.978741
H  -1.789914 -0.256696 -1.295735
H  -2.098979 1.521473 -1.129725
H  -4.394041 -0.726819 -1.350673
H  -4.682952 1.048908 -1.228687
H  1.149668 -0.783949 2.304499
H  0.92886 0.962539 1.959922
H  2.358378 -2.1696 0.312954
H  2.725576 2.117666 0.892755
H  4.507535 -2.179794 -0.978474
H  4.870048 2.11387 -0.402529
H  5.771065 -0.03678 -1.341719
H  -7.670566 -0.489232 0.288435
H  -6.837576 -1.194429 -1.149355
H  -7.157826 0.581415 -1.071551
