program: Gaussian 09
title: 000244476
version: EM64L-G09RevD.01
frameworkgroup: C1[X(C6H11BrO3)]
method: RPBEPBE
basis: SDD
operation: Freq
keyword: #p
keyword: freq=noraman
keyword: PBEPBE/SDD
title: #p freq=noraman PBEPBE/SDD
converged: YES YES NO NO
title: Mulliken charges:
elementType: Br O O O C C C C C C H H H H H H H H H H H
charge: 0.021911 -0.238552 -0.268819 -0.222007 -0.388196 -0.288186 -0.258978 0.351044 -0.498468 -0.767733 0.229694 0.247999 0.225770 0.231468 0.183811 0.192436 0.236307 0.200881 0.203240 0.302521 0.303854
chargesum: 0.00000
title: Mulliken charges with hydrogens summed into heavy atoms:
elementType: Br O O O C C C C C C
charge: 0.021911 -0.238552 -0.268819 -0.222007 0.089497 0.169052 0.117270 0.351044 0.141961 -0.161358
polarizability: 1.27198900e+02 -5.40999717e+00 7.43662065e+01 -4.22930543e+00 1.88046992e+00 6.88637551e+01
1716.lowfreq: -4.7117 0.0002 0.0003 0.0006 2.7234 10.6935 21.3333 35.8909 47.9535
frequency: 21.2745 35.8504 47.8751 53.7457 85.3042 117.5196 125.5429 161.2543 223.1048 269.3257 298.7967 340.1813 413.9233 493.7693 508.1939 639.7370 724.6151 770.8095 794.3686 877.8779 886.0048 902.6703 966.4253 1052.8796 1068.5122 1079.9761 1088.0385 1110.4929 1143.3155 1159.1985 1198.1408 1219.8200 1233.6806 1275.0241 1284.2244 1289.3332 1372.4672 1390.9311 1426.8836 1438.7707 1457.8843 1458.4183 1467.7210 1479.4110 1493.9009 1637.8071 2903.9932 2926.3443 2951.5702 2998.5403 3016.2003 3024.7811 3078.8025 3085.5643 3105.5194 3106.7978 3182.8129
redmass: 5.9959 6.5456 3.0367 3.1999 2.7702 2.4122 6.4757 4.0908 1.2101 2.7409 5.3239 3.4449 3.5294 3.8237 6.4642 4.8026 7.1338 1.9584 1.4807 1.6953 2.8093 1.7153 6.5337 4.2748 2.9510 2.2738 2.3105 1.2667 1.6149 1.5018 1.2447 1.6166 1.5970 1.1596 1.1705 1.2165 1.2889 1.3946 1.1182 1.1631 1.0962 1.0513 1.0613 1.0772 1.0830 9.6340 1.0536 1.0354 1.1057 1.1028 1.0602 1.0577 1.1038 1.0556 1.0971 1.1077 1.1125
irintensity: 0.4280 1.8380 5.1452 3.2534 0.5404 2.1546 1.7315 0.5695 4.7398 13.5616 1.0505 9.3703 12.3605 0.8393 23.8836 20.1618 0.5164 13.8216 0.0601 4.3377 7.2743 3.4358 105.4478 40.8975 3.0623 187.6721 25.9097 0.5099 6.1157 3.5738 0.7208 147.7687 95.2873 0.4207 15.9621 6.5976 1.3400 23.1315 18.3135 1.5151 9.6365 11.8554 13.7642 4.4513 7.7099 172.9369 55.4802 99.8666 64.3364 73.5624 3.5218 40.5310 3.8113 6.1782 30.1046 28.7976 0.3674
temp: 298.150 k
press: 1.00000 atm
elementType: 35 8 8 8 6 6 6 6 6 6 1 1 1 1 1 1 1 1 1 1 1
symmnumber: 1
zpe: 436433.2 jmol-1
zpe.correction: 0.166229 hartree
zpe.thermalcorrener: 0.178726 hartree
zpe.thermalcorrenthalpy: 0.179670 hartree
zpe.thermalcorrgfe: 0.123349 hartree
zpe.sumelectzpe: -473.526351 hartree
zpe.sumelectthermal: -473.513853 hartree
zpe.sumelectthermalent: -473.512909 hartree
zpe.sumelectthermalfe: -473.569230 hartree
dipole: -2.5331 -1.5390 0.2969
dipole: 2.9788
quadrupole: -61.8285 -70.9690 -69.6766
quadrupole: 6.6822 9.1932 4.5927
quadrupole: 5.6629 -3.4776 -2.1852 6.6822 9.1932 4.5927
hfenergy: -473.6925792 hartree
pointgroup: C01 [X(C6H11Br1O3)]
dipole: -1.0106267 -0.205235 0.5567851 debye
dipolederiv: -0.3722206 0.0386235 -0.0515352 0.1207519 -0.167804 0.0246188 -0.0696427 0.0122954 -0.1070279 -1.2772942 -0.1827135 0.3338887 -0.3788147 -0.3523644 0.1360718 0.550585 0.0964338 -0.7959611 -1.1301812 0.0314799 -0.0709704 0.090751 -0.4066115 0.0163702 -0.1059471 -0.0010008 -0.4452958 -0.6010225 -0.0802786 -0.1462288 -0.1432981 -0.307238 -0.166837 0.2023358 0.034768 -0.9027175 -0.2142302 -0.0198682 -0.011046 -0.0541787 -0.0100197 0.0852078 -0.0552267 0.0168462 0.0919233 0.7881976 0.0775538 -0.1098926 0.1462896 0.3365753 -0.1258534 0.0090818 -0.0043547 0.2663897 0.6753632 -0.1382106 0.0271037 -0.1893135 0.386768 -0.0589589 0.0428441 -0.0230544 0.4777326 1.340736 0.2798967 -0.1325953 0.5312134 0.1919931 0.0963917 -0.7057909 -0.0882892 1.4056393 0.6789657 0.073328 0.0289742 0.2537264 0.2630432 0.0340942 0.0269314 0.0190817 0.3768693 0.1414971 -0.2623885 0.029075 -0.3416675 0.2617135 -0.0641584 0.051887 -0.0656158 0.0645676 0.0755661 0.0118162 -0.010416 0.0098906 -0.0194163 -0.0943666 0.001186 -0.1057093 -0.0231619 0.0816834 -0.019031 0.0321686 -0.0245247 0.0279551 0.0653799 0.0376795 0.0871683 -0.0382824 -0.0035562 -0.0205741 0.0252328 -0.0352653 0.0291147 0.0826914 0.011382 0.1159521 -0.0573608 -0.0111738 0.0107345 0.0325383 -0.0138962 -0.021698 -0.0384109 -0.0199337 -0.1316721 0.0121669 -0.0356766 -0.0198821 0.0448984 0.0387391 -0.0622652 0.1164898 0.0112815 0.1537035 -0.1485989 -0.0178017 0.0124518 -0.0190203 0.0682289 -0.1063775 -0.0995655 0.0052818 -0.1538264 -0.0980047 -0.078578 0.0911685 -0.0306585 0.1293904 -0.030664 0.0300737 -0.0388406 0.0252131 0.1071017 -0.0408511 -0.0337964 0.0168444 -0.1510866 -0.0019994 0.1118333 0.1058596 0.1215808 -0.1337555 -0.0137162 0.0077293 0.0197256 -0.1189778 -0.0411865 -0.16114 -0.0524866 -0.1401049 -0.1111703 0.0249613 0.0923209 0.0209848 0.047032 0.0116542 -0.0561484 -0.0235096 -0.0578446 0.0337388 -0.0106681 0.0496397 -0.0290716 0.01501 0.0188275 0.0662165 0.0150423 0.0884293 0.0252075 unknown
polarizability: 126.9798344|-6.6753447|72.0616809|3.6918332|-3.4781454|71.3873464 unknown
InChI: InChI=1S/C6H11BrO3/c1-9-3-2-4-10-6(8)5-7/h2-5H2,1H3
charge 0 multiplicity 1
21 atoms
Br 4.58043 -0.287258 0.250626
O  1.105185 0.053399 0.68035
O  -3.705008 0.514017 -0.098591
O  1.461725 -0.022375 -1.631042
C  -1.33536 0.256162 0.235161
C  -0.172296 -0.705291 0.514133
C  -2.669038 -0.495235 0.129718
C  1.826976 0.310984 -0.481651
C  -5.031305 -0.079703 -0.25619
C  3.10859 1.048352 -0.1477
H  -1.409307 1.002239 1.046642
H  -1.157314 0.798132 -0.710246
H  -0.288377 -1.229521 1.47697
H  -0.041976 -1.434058 -0.306812
H  -2.884233 -1.060317 1.066568
H  -2.647997 -1.22307 -0.713842
H  -5.725973 0.757737 -0.425471
H  -5.340888 -0.636332 0.654614
H  -5.06792 -0.770143 -1.126123
H  3.009863 1.659958 0.758554
H  3.461623 1.622224 -1.013868
