program: Gaussian 09
title: 000244471
version: EM64L-G09RevD.01
frameworkgroup: C1[X(C19H28O2)]
method: RPBEPBE
basis: SDD
operation: Freq
keyword: #pfreq=noraman
keyword: PBEPBE/SDD
title: #p freq=noraman PBEPBE/SDD
converged: YES YES NO NO
title: Mulliken charges:
elementType: O O C C C C C C C C C C C C C C C C C C C H H H H H H H H H H H H H H H H H H H H H H H H H H H H
charge: -0.250488 -0.248227 -0.384313 -0.382785 -0.384373 -0.377473 -0.373673 -0.376846 -0.380882 -0.456623 -0.323932 -0.034965 0.281199 -0.651551 0.452269 -0.597937 -0.366144 -0.416955 -0.219916 -0.220396 -0.242819 0.193018 0.196651 0.194645 0.200620 0.197468 0.192691 0.191670 0.202131 0.196956 0.189854 0.207964 0.230636 0.193973 0.213017 0.198115 0.205134 0.233049 0.224692 0.211857 0.237490 0.241319 0.213864 0.217198 0.260082 0.232321 0.226319 0.225850 0.228246
chargesum: 0.00000
title: Mulliken charges with hydrogens summed into heavy atoms:
elementType: O O C C C C C C C C C C C C C C C C C C C
charge: -0.250488 -0.248227 0.005356 0.012480 0.005786 0.016329 0.013137 0.061754 0.026108 -0.053374 0.133809 0.176892 0.281199 -0.172743 0.452269 -0.166875 -0.106062 -0.184634 0.006403 0.005455 -0.014574
polarizability: 2.90275635e+02 1.18168257e+01 1.88719475e+02 2.07008332e+01 -6.99091373e+00 1.54056765e+02
1716.lowfreq: -17.6914 -4.9228 -0.0010 0.0009 0.0012 2.5609 3.8524 11.6251 19.3594
frequency: -4.9664 11.3582 19.2268 23.9145 27.8353 33.9302 45.9575 59.3883 65.9199 81.2111 101.1216 106.4589 113.0315 127.4208 140.3239 145.5536 163.2734 203.9216 220.6035 264.9052 299.8936 307.8719 322.7764 387.2972 400.3846 404.0652 447.3263 465.0997 475.7177 495.0738 529.6613 611.0724 622.4448 637.1112 697.5172 708.2596 719.2151 726.4331 741.8728 746.4173 769.8713 797.0148 816.5550 831.1020 854.0937 873.7695 917.2417 919.3564 927.8104 939.2611 945.7444 956.9940 977.1770 986.6283 989.8436 993.2704 996.0850 1001.6704 1010.2455 1027.2634 1031.7502 1037.3799 1056.9702 1067.3741 1077.7112 1079.0229 1080.1019 1097.6870 1108.5937 1166.7445 1172.2479 1176.8294 1189.6341 1202.3911 1203.0023 1209.9521 1228.4419 1236.8905 1241.8035 1265.0059 1270.2923 1277.4469 1282.2969 1286.2898 1286.8682 1289.8810 1294.1556 1296.5361 1303.8473 1328.8428 1333.2774 1346.6399 1354.4666 1356.8003 1370.6131 1383.7596 1425.2020 1440.6693 1452.2094 1455.1903 1457.4132 1459.4218 1461.0376 1464.0692 1467.9318 1475.3846 1482.8345 1483.0538 1487.2593 1594.5762 1611.2946 1634.2969 1657.7147 2950.0600 2950.8552 2952.0348 2954.2026 2957.3983 2963.8822 2967.8305 2984.8303 2990.1006 2991.9037 3000.7229 3010.4662 3015.3282 3020.8629 3021.4062 3034.7600 3044.9229 3054.1191 3070.8018 3089.9593 3097.1078 3102.4634 3120.3641 3126.7177 3138.6002 3148.6904 3163.8476 3193.7194
redmass: 4.1541 5.1668 4.2702 2.7328 3.6066 3.0745 3.6879 3.1213 2.3159 2.6916 2.6208 4.0111 2.2978 2.6834 2.0643 2.1920 4.8773 3.2702 4.3343 3.4208 3.0079 3.9393 2.9955 2.9179 2.6309 2.8122 2.5266 3.2285 2.9723 3.9010 4.3876 5.4129 5.1206 1.5317 3.8733 1.9669 1.0630 1.0815 1.1714 1.6610 1.2468 2.8571 1.4828 3.3146 1.2493 1.3039 1.8285 1.5840 2.5293 1.3642 1.4586 2.9378 1.3935 4.3579 5.5549 1.9781 1.3474 1.4220 1.3813 2.2309 2.8757 2.1596 1.9857 2.8053 2.2825 1.7411 2.1203 3.5772 1.8793 1.8468 1.0558 1.7587 1.1350 1.8800 1.7023 1.4317 1.5730 1.3294 1.3286 1.2439 1.2762 1.0622 1.1052 1.4138 1.2435 1.1436 1.1110 1.1302 1.3126 1.3629 1.2940 1.4805 1.6518 1.6059 1.4071 7.3854 1.1799 2.0629 1.0980 1.1383 1.0864 1.0768 1.0733 1.0679 1.0899 1.0988 1.1051 2.1921 1.1010 6.1731 6.1000 8.9950 4.7403 1.0594 1.0588 1.0611 1.0590 1.0596 1.0597 1.0605 1.0959 1.0670 1.0902 1.0992 1.0992 1.0619 1.1028 1.0578 1.1041 1.1037 1.1036 1.0793 1.0739 1.0999 1.1084 1.0853 1.0874 1.0922 1.0965 1.1017 1.1145
irintensity: 0.0202 0.2737 0.2994 0.0939 0.1794 0.5126 0.1470 0.1534 0.0767 0.0860 0.6225 1.6868 0.0985 0.9885 0.1078 0.1198 0.2622 0.8505 0.9351 6.8639 1.7125 8.9165 2.1446 8.5756 0.4663 0.0364 1.5887 3.4876 0.6982 0.8706 16.5677 2.9913 6.5273 16.7613 6.2537 51.3005 13.8747 0.3248 18.7041 42.6233 0.9698 4.3450 0.9326 5.3341 0.3724 4.0136 0.9028 6.2836 12.3252 84.5789 11.4817 57.9653 0.2066 4.1971 1.8958 4.8516 0.2940 28.0685 0.5464 8.9152 0.1231 0.7947 10.4756 7.5321 6.8027 32.1312 1.4270 24.3757 200.2460 1.7273 1.0097 10.8777 2.5991 11.9021 7.6503 7.6158 145.2222 6.8478 6.7988 0.0624 1.9877 0.4240 1.9276 42.9267 28.2746 1.2907 1.5233 0.9604 2.3399 0.8179 19.1228 0.3953 0.1589 0.2609 0.3054 2.1683 3.5604 8.1796 7.5938 18.0498 2.6485 0.7224 1.3692 0.0839 0.1827 3.9660 0.2640 22.4886 33.9261 3.4253 19.2107 128.7834 22.2202 1.0247 0.1120 14.3673 6.1169 0.6347 29.0278 174.8745 1.7882 23.4213 2.3894 5.2035 1.9116 10.8179 2.0500 41.0644 14.3455 143.4044 78.3011 46.6811 7.6036 5.4709 27.7634 4.2450 0.7093 20.4950 32.3064 21.9463 33.4095
temp: 298.150 k
press: 1.00000 atm
elementType: 8 8 6 6 6 6 6 6 6 6 6 6 6 6 6 6 6 6 6 6 6 1 1 1 1 1 1 1 1 1 1 1 1 1 1 1 1 1 1 1 1 1 1 1 1 1 1 1 1
symmnumber: 1
zpe: 1111635.4 jmol-1
zpe.correction: 0.423400 hartree
zpe.thermalcorrener: 0.446376 hartree
zpe.thermalcorrenthalpy: 0.447320 hartree
zpe.thermalcorrgfe: 0.365109 hartree
zpe.sumelectzpe: -889.630845 hartree
zpe.sumelectthermal: -889.607868 hartree
zpe.sumelectthermalent: -889.606924 hartree
zpe.sumelectthermalfe: -889.689135 hartree
dipole: 0.2013 -1.7658 -0.1740
dipole: 1.7857
quadrupole: -131.7028 -126.6988 -127.6241
quadrupole: 2.2667 1.9850 -2.4472
quadrupole: -3.0276 1.9764 1.0511 2.2667 1.9850 -2.4472
hfenergy: -890.0542443 hartree
pointgroup: C01 [X(C19H28O2)]
dipole: -0.0778726 -0.6883584 -0.1169488 debye
polarizability: 290.7144868|-16.3342502|182.6084947|15.4957657|15.0763628|159.7288941 unknown
InChI: InChI=1S/C19H28O2/c1-2-3-4-5-6-7-8-9-13-16-21-19(20)17-18-14-11-10-12-15-18/h2,10-12,14-15H,1,3-9,13,16-17H2
charge 0 multiplicity 1
49 atoms
O  2.524405 -0.835666 -0.465433
O  2.758958 1.448543 -0.039556
C  -3.80635 -0.428975 0.497823
C  -2.513997 -0.303769 -0.33959
C  -5.083424 -0.085469 -0.302033
C  -1.233447 -0.641165 0.457549
C  -6.381792 -0.236868 0.521727
C  0.04744 -0.526163 -0.401999
C  -7.654881 0.113632 -0.280792
C  -8.957448 -0.064534 0.544681
C  1.30615 -0.869871 0.404583
C  -10.207191 0.223338 -0.260219
C  3.157316 0.400477 -0.600035
C  4.392954 0.283297 -1.485882
C  5.684427 0.293097 -0.663796
C  -11.148452 1.15043 0.050302
C  6.024545 1.417178 0.132379
C  6.560879 -0.819273 -0.694143
C  7.222957 1.427192 0.879281
C  7.762387 -0.808571 0.051808
C  8.097558 0.31561 0.840051
H  -3.888685 -1.463271 0.892966
H  -3.737612 0.237583 1.38279
H  -2.583005 -0.974406 -1.22146
H  -2.43357 0.728429 -0.738982
H  -5.009069 0.954831 -0.681886
H  -5.140558 -0.739282 -1.19758
H  -1.317593 -1.670014 0.866068
H  -1.157228 0.039154 1.330813
H  -6.325117 0.411442 1.42102
H  -6.45972 -1.279708 0.89521
H  -0.024385 -1.207392 -1.272147
H  0.140274 0.504253 -0.794225
H  -7.706097 -0.526276 -1.186376
H  -7.594317 1.160119 -0.640808
H  -8.99171 -1.111133 0.916946
H  -8.927032 0.590205 1.437617
H  1.450458 -0.161005 1.239861
H  1.28306 -1.906349 0.780153
H  -10.334473 -0.37976 -1.174228
H  4.323269 -0.640041 -2.081925
H  4.380823 1.150021 -2.17232
H  -12.0300 1.311215 -0.580713
H  -11.061824 1.775587 0.948159
H  5.341977 2.273889 0.172481
H  6.303173 -1.695342 -1.301426
H  7.475004 2.301051 1.490736
H  8.432518 -1.67504 0.017324
H  9.028444 0.325574 1.418126
