program: Gaussian 09
title: 000244469
version: EM64L-G09RevD.01
frameworkgroup: C1[X(C13H23BrO2)]
method: RPBEPBE
basis: SDD
operation: Freq
keyword: #p
keyword: freq=noraman
keyword: PBEPBE/SDD
title: #p freq=noraman PBEPBE/SDD
converged: YES YES NO NO
title: Mulliken charges:
elementType: Br O O C C C C C C C C C C C C C H H H H H H H H H H H H H H H H H H H H H H H
charge: 0.019969 -0.236571 -0.224834 -0.382687 -0.384210 -0.385264 -0.373093 -0.374655 -0.381585 -0.378599 -0.456776 -0.314814 -0.034734 -0.598064 0.348914 -0.770833 0.194061 0.196172 0.196354 0.200480 0.194804 0.195982 0.195863 0.191382 0.203116 0.193077 0.212348 0.195170 0.232022 0.210683 0.205282 0.198447 0.229417 0.236216 0.212007 0.213994 0.217305 0.302608 0.301046
chargesum: 0.00000
title: Mulliken charges with hydrogens summed into heavy atoms:
elementType: Br O O C C C C C C C C C C C C C
charge: 0.019969 -0.236571 -0.224834 0.007546 0.012624 0.005522 0.014152 0.021539 0.025933 0.064106 -0.053047 0.150819 0.177273 -0.166765 0.348914 -0.167179
polarizability: 2.37141804e+02 3.29641190e+00 1.33385641e+02 -1.23525086e+01 7.95909024e-01 1.22977967e+02
1716.lowfreq: -16.7174 -0.0006 -0.0002 0.0008 2.5150 3.4551 12.2631 17.6128 25.6241
frequency: 10.3362 17.5119 24.8056 25.5788 38.9248 51.6765 58.7285 65.5343 86.8709 102.7722 112.6603 119.2984 131.6684 144.9502 152.7492 188.1617 209.9251 271.6530 300.4972 317.6730 384.3813 399.9027 445.7005 474.4513 500.8988 506.7412 637.1746 640.7085 719.2631 724.8503 726.6890 742.6010 765.8138 784.7414 816.9921 873.8733 898.1018 917.9184 938.2773 943.8569 950.7080 987.6718 995.5519 1001.5792 1010.1677 1032.4087 1038.1990 1057.1935 1067.1974 1078.4833 1081.0562 1085.6172 1099.7679 1168.5007 1177.7386 1204.2096 1209.2648 1221.2663 1232.8493 1239.8031 1241.1550 1267.4436 1270.9683 1278.0050 1284.9604 1289.2432 1292.2816 1298.0001 1299.9911 1304.8287 1330.5389 1348.2617 1355.3198 1358.0216 1371.9871 1425.0646 1427.0769 1452.3831 1457.2731 1460.0243 1461.2965 1464.5561 1468.8119 1476.0053 1483.1870 1487.8107 1633.9007 1657.9467 2950.2604 2951.2329 2952.3320 2955.0277 2958.1744 2964.7528 2968.4142 2985.0783 2991.3195 2992.4223 3001.2618 3011.1050 3021.7353 3023.2746 3035.5101 3045.2425 3055.6765 3070.4774 3084.8583 3089.3129 3105.9234 3182.4290 3192.9525
redmass: 5.8260 4.9342 4.5553 2.7489 5.7951 3.9101 2.6647 2.3975 2.7483 2.9251 2.2327 3.6169 3.1171 2.0408 2.0787 4.6914 3.4751 2.7420 3.1328 3.8669 3.1500 2.6451 2.5677 3.0710 3.3188 6.9990 1.5646 4.4649 1.0630 6.1766 1.1039 1.1112 1.4103 2.0798 1.3420 1.3047 1.7824 1.9402 1.3568 1.6128 3.2848 4.9181 1.7828 1.5401 1.3438 3.5277 1.8185 2.0222 2.8668 2.3416 2.1221 1.4711 3.9165 1.8932 1.7395 1.3168 1.4453 1.5983 1.5770 1.3477 1.3155 1.2325 1.2837 1.0580 1.1052 1.1045 1.2010 1.1071 1.1271 1.3088 1.3737 1.4835 1.6472 1.5943 1.3605 1.1791 1.1179 1.0964 1.0895 1.0759 1.0732 1.0698 1.0882 1.0982 1.1009 1.1011 9.5438 4.7521 1.0597 1.0588 1.0611 1.0590 1.0594 1.0597 1.0600 1.0963 1.0717 1.0851 1.0995 1.0993 1.1027 1.0581 1.1041 1.1036 1.1037 1.0793 1.0556 1.0741 1.1083 1.1124 1.1144
irintensity: 0.4688 0.2414 0.0710 0.3015 1.1332 0.1091 0.3460 0.1887 0.0572 0.1789 0.1699 0.9722 0.1788 0.2017 0.0352 0.2305 0.8790 13.3850 1.3382 2.2397 5.7664 0.4942 3.0045 0.1619 2.1515 22.2347 12.1369 25.7174 13.5812 0.3197 0.9881 5.8881 4.3250 4.1668 2.6612 0.0785 3.1467 1.2029 85.0383 21.2626 57.6063 2.7124 10.8062 20.2301 2.5907 1.0355 2.0186 11.5968 5.9420 3.6291 0.3467 131.7668 6.7102 3.3724 6.4728 21.1041 17.4060 142.4938 93.2801 16.2218 0.4588 5.2113 1.8699 1.8486 0.3925 2.6086 0.2182 0.0346 2.3623 0.8782 1.8580 0.0594 0.0400 0.3004 0.3246 3.5451 18.7058 8.1886 2.8519 0.5339 1.2934 0.2750 0.1208 3.9074 0.9587 33.0231 171.6122 22.0418 1.0871 0.1897 15.5560 4.8766 1.4573 23.8844 179.6171 0.6338 11.8585 15.7106 2.1605 2.8889 0.9677 36.0108 14.6943 149.3432 72.8421 47.4595 6.5298 7.4378 24.7740 0.5099 33.2561
temp: 298.150 k
press: 1.00000 atm
elementType: 35 8 8 6 6 6 6 6 6 6 6 6 6 6 6 6 1 1 1 1 1 1 1 1 1 1 1 1 1 1 1 1 1 1 1 1 1 1 1
symmnumber: 1
zpe: 877755.5 jmol-1
zpe.correction: 0.334319 hartree
zpe.thermalcorrener: 0.354874 hartree
zpe.thermalcorrenthalpy: 0.355818 hartree
zpe.thermalcorrgfe: 0.277799 hartree
zpe.sumelectzpe: -671.770737 hartree
zpe.sumelectthermal: -671.750183 hartree
zpe.sumelectthermalent: -671.749238 hartree
zpe.sumelectthermalfe: -671.827257 hartree
dipole: 1.9448 -0.3481 -1.5487
dipole: 2.5104
quadrupole: -131.8397 -106.1732 -111.3322
quadrupole: -1.9395 7.6303 -3.5707
quadrupole: -15.3913 10.2752 5.1161 -1.9395 7.6303 -3.5707
hfenergy: -672.1050565 hartree
pointgroup: C01 [X(C13H23Br1O2)]
dipole: 0.7574439 0.3072472 -0.554374 debye
polarizability: 236.9554278|10.5705634|127.8218675|-8.5668184|5.1101075|128.7281161 unknown
InChI: InChI=1S/C13H23BrO2/c1-2-3-4-5-6-7-8-9-10-11-16-13(15)12-14/h2H,1,3-12H2
charge 0 multiplicity 1
39 atoms
Br -8.20955 -0.084373 0.112394
O  -4.779388 0.089274 -0.525257
O  -4.960971 0.201879 1.804848
C  1.587392 -0.566922 -0.080836
C  0.277376 0.251177 -0.127315
C  2.853452 0.313369 0.020351
C  4.163167 -0.505546 0.06487
C  -0.985411 -0.633707 -0.231774
C  5.428172 0.374897 0.173097
C  -2.29274 0.192698 -0.272762
C  6.739721 -0.455151 0.211706
C  -3.521971 -0.715611 -0.399118
C  7.972416 0.404594 0.395448
C  9.029714 0.461572 -0.4534
C  -5.400102 0.460415 0.661008
C  -6.679023 1.220584 0.369053
H  1.655138 -1.20258 -0.988592
H  1.555013 -1.262142 0.783954
H  0.309879 0.94769 -0.990836
H  0.207002 0.883761 0.781711
H  2.787275 0.94762 0.929078
H  2.886015 1.010159 -0.843116
H  4.232127 -1.13693 -0.845655
H  4.129595 -1.205369 0.926263
H  -1.014331 -1.33044 0.631253
H  -0.914639 -1.263738 -1.143075
H  5.469925 1.077887 -0.682757
H  5.364404 0.999617 1.088348
H  -2.379784 0.797776 0.649464
H  -2.266739 0.892581 -1.130318
H  6.831437 -1.051563 -0.717013
H  6.667673 -1.179456 1.051461
H  -3.501905 -1.306899 -1.329292
H  -3.619783 -1.381096 0.477675
H  7.982379 1.03434 1.300365
H  9.889801 1.112715 -0.259714
H  9.064334 -0.143815 -1.368175
H  -6.965523 1.840688 1.227803
H  -6.617342 1.789548 -0.567946
