program: Gaussian 09
title: 000244464
version: EM64L-G09RevD.01
frameworkgroup: C1[X(C11H19Cl3O2)]
method: RPBEPBE
basis: SDD
operation: Freq
keyword: #p
keyword: freq=noraman
keyword: PBEPBE/SDD
title: #p freq=noraman PBEPBE/SDD
converged: YES YES NO NO
title: Mulliken charges:
elementType: Cl Cl Cl O O C C C C C C C C C C C H H H H H H H H H H H H H H H H H H H
charge: 0.146973 0.106797 0.118159 -0.224404 -0.191609 -0.383644 -0.374594 -0.370812 -0.362124 -0.353940 -0.369278 -0.356185 -0.324284 -0.695978 0.488418 -0.729530 0.195947 0.194538 0.189425 0.193391 0.188547 0.189661 0.204489 0.208619 0.188686 0.189337 0.204699 0.224044 0.194460 0.194732 0.236656 0.243136 0.210297 0.210098 0.215274
chargesum: 0.00000
title: Mulliken charges with hydrogens summed into heavy atoms:
elementType: Cl Cl Cl O O C C C C C C C C C C C
charge: 0.146973 0.106797 0.118159 -0.224404 -0.191609 0.006841 0.008221 0.007397 0.050985 0.024083 0.059465 0.033007 0.155508 -0.060310 0.488418 -0.729530
polarizability: 1.79546770e+02 5.75896103e+00 1.48198954e+02 3.67400846e+00 -8.79959628e+00 1.35544515e+02
1716.lowfreq: -6.6232 -3.4143 0.0015 0.0019 0.0024 0.9004 12.1223 16.5322 35.9290
frequency: 11.9065 16.2148 35.9138 41.7810 45.2854 53.7152 79.9619 92.7335 109.3823 121.8685 141.8009 144.8949 153.8848 185.5697 207.9367 233.4983 235.0458 252.5373 263.8896 275.9936 313.8584 331.8157 372.7204 392.9661 438.2734 453.3160 517.0123 606.0456 692.3877 720.6775 723.2967 732.4867 751.3181 753.9942 782.8118 813.9247 846.4329 888.1630 891.8180 923.9740 947.4580 994.4921 999.0004 1018.6748 1045.0973 1055.8911 1081.0853 1082.1677 1086.3649 1121.5813 1151.9389 1163.8685 1188.8347 1212.4502 1224.9186 1241.9028 1259.3446 1272.8144 1283.0384 1284.9381 1294.6794 1297.7912 1305.9815 1335.3945 1352.7580 1354.4372 1357.4775 1364.5785 1388.8988 1447.7827 1459.9986 1461.9874 1462.1920 1466.1338 1471.8275 1477.4170 1478.9185 1485.3142 1489.1759 1646.7658 2950.4689 2951.9325 2954.6186 2961.6274 2967.7874 2970.4290 2972.1327 2977.5869 2984.7003 2991.8952 3003.2843 3017.1151 3024.2172 3030.5091 3039.3333 3052.7285 3068.9480 3070.5113 3106.6007
redmass: 16.4977 6.6321 4.6378 1.9216 4.1827 4.5668 2.9142 1.7843 4.2627 3.5546 1.9455 2.2719 3.8726 5.2234 9.1196 3.6192 1.2410 7.4102 13.4828 4.5827 4.7876 3.6778 6.2812 18.5770 3.0898 3.3106 2.5557 11.7483 6.1522 1.1943 1.2633 1.5247 1.8092 7.1558 1.5440 3.1314 1.4596 1.9415 1.5600 3.2287 1.7527 1.9934 4.2116 1.5389 2.3685 2.5300 2.3961 2.2543 2.1678 2.6317 2.0113 6.4023 1.7086 1.2822 1.4019 1.2725 1.2749 1.2554 1.0271 1.1704 1.0813 1.1171 1.2808 1.3926 1.5695 1.5259 1.3813 1.5508 1.2161 1.0807 1.0941 1.0750 1.0696 1.0708 1.0788 1.0437 1.0794 1.0877 1.0933 10.7256 1.0586 1.0586 1.0590 1.0592 1.0588 1.0601 1.0365 1.0611 1.0962 1.0982 1.1010 1.0987 1.0842 1.0825 1.1017 1.1016 1.1006 1.0993 1.1089
irintensity: 0.0095 0.1275 0.3994 0.2148 0.8961 0.1680 0.0421 0.0454 0.0138 0.5217 0.0466 0.0918 0.4590 1.4981 0.2408 0.4730 0.0447 2.4479 0.1913 0.6111 6.5131 6.2966 5.0021 3.0220 2.1930 0.3059 2.0727 137.9288 33.9469 8.4464 25.2416 26.2031 57.0702 56.8654 23.6533 21.2030 1.1999 5.2423 5.9477 33.6279 53.9789 30.1721 0.1524 0.5584 21.3944 9.9151 0.9420 4.0762 6.2351 15.5178 15.2209 253.0523 0.9784 21.7948 0.5884 6.8121 0.6380 3.8484 0.3447 1.6835 0.2335 0.1249 1.4930 0.7699 0.7277 0.6530 2.1035 0.9729 11.2179 5.4701 16.9687 2.4114 0.0526 0.8995 0.7071 12.0807 2.7517 1.5374 28.8929 142.6263 0.1390 6.3906 0.1205 17.2517 110.0295 23.5889 35.9014 81.4422 1.3937 1.7268 1.2387 3.2201 9.8930 21.7685 70.0605 117.9912 94.8295 55.2869 14.8343
temp: 298.150 k
press: 1.00000 atm
elementType: 17 17 17 8 8 6 6 6 6 6 6 6 6 6 6 6 1 1 1 1 1 1 1 1 1 1 1 1 1 1 1 1 1 1 1
symmnumber: 1
zpe: 740864.7 jmol-1
zpe.correction: 0.282180 hartree
zpe.thermalcorrener: 0.302610 hartree
zpe.thermalcorrenthalpy: 0.303554 hartree
zpe.thermalcorrgfe: 0.227795 hartree
zpe.sumelectzpe: -1959.880955 hartree
zpe.sumelectthermal: -1959.860526 hartree
zpe.sumelectthermalent: -1959.859582 hartree
zpe.sumelectthermalfe: -1959.935340 hartree
dipole: -1.9005 2.7593 -0.6872
dipole: 3.4202
quadrupole: -123.5973 -111.1761 -123.6700
quadrupole: 2.9378 -0.9053 1.3220
quadrupole: -4.1162 8.3050 -4.1889 2.9378 -0.9053 1.3220
hfenergy: -1960.1631358 hartree
pointgroup: C01 [X(C11H19Cl3O2)]
dipole: -0.6990264 -1.0671123 0.4281713 debye
polarizability: 180.1421126|-4.3509469|144.6327449|-1.7180056|-10.4974931|138.5153802 unknown
InChI: InChI=1S/C11H19Cl3O2/c1-2-3-4-5-6-7-8-9-16-10(15)11(12,13)14/h2-9H2,1H3
charge 0 multiplicity 1
35 atoms
Cl 3.919476 2.403481 -1.373937
Cl 2.370082 2.021593 1.193369
Cl 5.135404 0.789027 0.869082
O  2.667622 -0.949605 0.451577
O  2.638105 -0.252591 -1.781418
C  -2.734105 -0.229387 -0.172119
C  -1.815991 -1.306303 0.447872
C  -4.208216 -0.356223 0.274368
C  -0.347845 -1.196802 -0.021054
C  -5.127818 0.727347 -0.332249
C  0.563848 -2.25262 0.642914
C  -6.604429 0.590498 0.10471
C  2.001954 -2.257918 0.115882
C  -7.516885 1.678029 -0.50246
C  2.897156 -0.072185 -0.577336
C  3.552588 1.221125 -0.012407
H  -2.353595 0.777218 0.099418
H  -2.679654 -0.293093 -1.27899
H  -2.208505 -2.313347 0.193176
H  -1.856155 -1.227393 1.554644
H  -4.590579 -1.360082 -0.006715
H  -4.261889 -0.302802 1.38219
H  -0.301762 -1.305577 -1.123765
H  0.032668 -0.182512 0.212228
H  -5.069344 0.681511 -1.440041
H  -4.753216 1.73175 -0.043562
H  0.152944 -3.26826 0.463757
H  0.576459 -2.104612 1.74006
H  -6.977969 -0.4127 -0.18625
H  -6.662068 0.633897 1.211767
H  2.628462 -3.00842 0.624728
H  2.044295 -2.395452 -0.979153
H  -7.182755 2.688876 -0.201111
H  -7.501372 1.636694 -1.608037
H  -8.56591 1.557439 -0.174635
