program: Gaussian 09
title: 000244463
version: EM64L-G09RevD.01
frameworkgroup: C1[X(C7H5Cl7O4)]
method: RPBEPBE
basis: SDD
operation: Freq
keyword: #p
keyword: freq=noraman
keyword: PBEPBE/SDD
title: #p freq=noraman PBEPBE/SDD
converged: YES YES NO NO
title: Mulliken charges:
elementType: Cl Cl Cl Cl Cl Cl Cl O O O O C C C C C C C H H H H H
charge: -0.028480 0.154748 0.132690 0.129627 0.157098 0.132589 0.125938 -0.220946 -0.198657 -0.187376 -0.187470 0.029295 -0.342528 -0.627138 0.521444 0.499692 -0.766094 -0.758643 0.300485 0.248387 0.287851 0.287945 0.309543
chargesum: 0.00000
title: Mulliken charges with hydrogens summed into heavy atoms:
elementType: Cl Cl Cl Cl Cl Cl Cl O O O O C C C C C C C
charge: -0.028480 0.154748 0.132690 0.129627 0.157098 0.132589 0.125938 -0.220946 -0.198657 -0.187376 -0.187470 0.329781 0.193709 -0.029650 0.521444 0.499692 -0.766094 -0.758643
polarizability: 1.63105743e+02 2.15328555e+00 1.46822237e+02 -2.40476036e+00 -1.02145937e+01 1.44994763e+02
1716.lowfreq: -4.7024 0.0009 0.0017 0.0020 4.2407 6.5315 13.1599 15.7974 18.8446
frequency: 12.8926 15.7075 18.7829 36.8424 38.0627 51.8942 63.7919 71.3774 92.9133 128.5415 141.3741 155.5010 183.0091 200.2784 214.8901 225.8452 237.8206 265.8823 267.7276 274.3060 284.2301 319.6165 331.8756 381.0457 396.4887 399.4159 413.8016 449.4580 576.7048 614.2163 618.6876 652.0320 699.0567 714.3297 742.1937 757.6449 760.9982 765.2029 808.6786 860.3218 883.8038 934.9428 974.9258 996.3399 1024.0453 1116.3381 1150.7804 1171.2274 1185.9180 1251.8616 1260.3176 1313.8505 1327.3136 1377.3581 1434.1617 1447.2635 1640.7241 1644.1596 3018.2390 3050.4713 3066.8759 3149.6321 3153.8884
redmass: 29.2252 29.2006 24.5450 18.9788 16.9526 15.8606 13.1226 11.6053 17.0826 12.3456 14.1817 9.7931 7.4341 9.2864 15.1020 14.1383 13.1784 20.5370 16.8787 18.0298 15.3153 4.1589 8.8960 7.1704 19.7391 9.8903 4.8236 4.6666 6.7777 11.9780 12.6893 5.8917 6.4627 8.3751 7.6743 11.7366 12.0521 10.6653 5.5023 7.8238 1.7713 9.7228 5.6943 2.5102 2.2157 2.1828 5.0930 9.1674 1.3029 1.3276 1.2043 1.3014 1.2788 1.3869 1.0891 1.0925 11.4589 12.2496 1.0837 1.0626 1.0587 1.1089 1.1043
irintensity: 0.0390 0.0068 0.1467 0.8333 0.0473 1.4227 2.7143 0.3304 0.1175 0.8024 0.8334 2.9862 5.0589 1.0501 2.5409 0.5605 3.1221 0.1491 0.7129 2.1577 0.4425 10.0672 0.3678 5.9672 1.2402 11.1888 21.2440 7.7889 6.5544 153.9270 117.7362 15.8425 26.3164 37.7349 73.2539 92.9060 33.6052 130.4682 45.8016 6.4680 6.2144 109.7478 133.0272 18.3216 49.3972 2.5702 351.0816 266.9258 0.5642 20.6684 2.1449 10.3534 15.9264 3.5967 18.8824 24.3457 60.0549 199.5830 3.2851 9.6165 5.0856 1.2767 1.7688
temp: 298.150 k
press: 1.00000 atm
elementType: 17 17 17 17 17 17 17 8 8 8 8 6 6 6 6 6 6 6 1 1 1 1 1
symmnumber: 1
zpe: 309939.7 jmol-1
zpe.correction: 0.118050 hartree
zpe.thermalcorrener: 0.139007 hartree
zpe.thermalcorrenthalpy: 0.139952 hartree
zpe.thermalcorrgfe: 0.061493 hartree
zpe.sumelectzpe: -3789.629759 hartree
zpe.sumelectthermal: -3789.608801 hartree
zpe.sumelectthermalent: -3789.607857 hartree
zpe.sumelectthermalfe: -3789.686316 hartree
dipole: -0.2849 2.0876 -0.0488
dipole: 2.1075
quadrupole: -159.6385 -149.3342 -155.0830
quadrupole: -0.7256 3.0823 1.7945
quadrupole: -4.9533 5.3510 -0.3978 -0.7256 3.0823 1.7945
hfenergy: -3789.7478087 hartree
pointgroup: C01 [X(C7H5Cl7O4)]
dipole: -0.2349122 -0.5889129 0.5343432 debye
dipolederiv: -0.2118531 0.0785275 -0.1128605 0.0445089 -0.2036475 0.0332461 -0.1188323 0.1142749 -0.3978342 -0.2654233 0.0311697 0.2743601 0.0178441 -0.0922047 -0.0026815 0.2666751 -0.0306577 -0.5655264 -0.3418594 0.2254307 0.0408715 0.3183695 -0.5527182 -0.0297129 0.033751 -0.0430683 -0.117599 -0.3913878 0.061278 -0.2797417 0.0218792 -0.1518511 0.0741235 -0.2939436 0.098077 -0.4707399 -0.5042752 -0.1301592 -0.2494836 -0.1178616 -0.1254543 -0.0902428 -0.2795755 -0.1073434 -0.2934497 -0.2001212 0.1098349 0.1516372 0.1517979 -0.3152113 -0.2772572 0.1469821 -0.233844 -0.5129776 -0.4858738 -0.1390294 0.2172417 -0.1921387 -0.2510663 0.1658186 0.2651236 0.1206079 -0.2909276 -1.0013744 -0.3699725 0.6213103 -0.311197 -0.5373142 0.226979 0.6935318 0.246414 -0.8786268 -1.1526184 0.3165131 -0.4798047 0.2140608 -0.5044524 0.0928459 -0.6849762 0.2170224 -0.6323733 -0.4406707 -0.2240877 0.0071079 -0.0723534 -0.5461601 -0.2907009 0.263205 -0.0602154 -0.6793478 -0.5756162 0.0876058 -0.1759805 -0.2275652 -0.7462316 -0.1192221 -0.2269647 0.0726991 -0.3499636 0.6199515 0.2467179 -0.3670189 0.3468388 0.4005153 -0.259507 -0.2046121 -0.1096631 0.0861466 0.5622169 -0.2456588 0.1505795 -0.3899367 0.3570687 -0.1918921 0.2261962 -0.1105843 0.308609 0.0759134 -0.0333596 0.2637668 -0.08801 0.0939813 -0.0284956 0.2471319 -0.134019 0.5932316 0.8702707 0.5854621 -0.4383346 0.4238904 0.7169806 0.2128763 -0.7713755 -0.0469766 1.1345631 1.1222835 -0.259147 0.617741 0.0962268 0.981413 0.000847 0.8303514 -0.2428364 0.5423961 0.9651971 -0.4658735 -0.0196277 -0.555866 0.7101924 -0.0212835 -0.0412607 -0.0741489 1.2687227 1.2656236 0.2291441 -0.142363 0.32408 0.5380565 0.3187124 -0.1839883 0.2955723 1.1820682 0.0578874 -0.03931 0.0107941 -0.0406262 0.0166589 0.1031825 -0.0760356 0.0065795 -0.0015376 -0.0291628 -0.0521959 0.0516757 0.0298834 -0.0147534 0.0769466 -0.0027531 0.0192083 0.0724866 0.054069 0.0163764 -0.0760052 0.0368973 0.0669363 -0.0299144 -0.0548184 -0.0134405 0.0655821 0.0109702 -0.0891533 -0.0572632 -0.0907255 0.0428749 0.037213 -0.0332499 0.0328434 -0.0113805 -0.004147 0.0598867 -0.0086021 0.060003 0.1163872 -0.0018809 -0.0005621 -0.0165014 -0.051522 unknown
polarizability: 162.0224062|-5.055026|137.0505553|2.734058|-3.4585347|155.8497813 unknown
InChI: InChI=1S/C7H5Cl7O4/c8-1-3(18-5(16)7(12,13)14)2-17-4(15)6(9,10)11/h3H,1-2H2
charge 0 multiplicity 1
23 atoms
Cl 1.553115 -2.554239 2.411657
Cl 3.999415 0.867683 -2.734749
Cl 2.177796 2.520604 -0.980272
Cl 4.269019 0.693718 0.270537
Cl -4.584522 1.009587 -1.808609
Cl -3.730052 2.526012 0.658137
Cl -1.879007 2.36189 -1.754929
O  1.352157 -0.223573 0.090898
O  -1.4535 0.507909 0.666843
O  1.862796 -1.08531 -2.014681
O  -2.841962 -0.997537 -0.447821
C  0.264017 -1.238992 0.252889
C  -0.707402 -0.632396 1.26724
C  0.831934 -2.593371 0.674201
C  2.043047 -0.257422 -1.103785
C  -2.492225 0.165718 -0.175176
C  3.076056 0.898682 -1.144036
C  -3.152329 1.449046 -0.742235
H  -0.22015 -1.38486 -0.732659
H  -1.422018 -1.398823 1.613985
H  -0.167069 -0.186956 2.112995
H  0.034147 -3.351501 0.693074
H  1.645436 -2.911968 0.008093
