program: Gaussian 09
title: 000244462
version: EM64L-G09RevD.01
frameworkgroup: C1[X(C8H13Cl3O2)]
method: RPBEPBE
basis: SDD
operation: Freq
keyword: #p
keyword: freq=noraman
keyword: PBEPBE/SDD
title: #p freq=noraman PBEPBE/SDD
converged: YES YES NO NO
title: Mulliken charges:
elementType: Cl Cl Cl O O C C C C C C C C H H H H H H H H H H H H H
charge: 0.146493 0.107124 0.118951 -0.227308 -0.194309 -0.030751 -0.362602 -0.343386 -0.377962 -0.708401 -0.693320 0.497378 -0.732686 0.196678 0.192262 0.203064 0.255044 0.229571 0.189209 0.232956 0.236878 0.208764 0.215583 0.205099 0.216746 0.218924
chargesum: 0.00000
title: Mulliken charges with hydrogens summed into heavy atoms:
elementType: Cl Cl Cl O O C C C C C C C C
charge: 0.146493 0.107124 0.118951 -0.227308 -0.194309 0.165928 0.032724 0.141229 0.044204 -0.047176 -0.052551 0.497378 -0.732686
polarizability: 1.26253643e+02 2.32560715e+00 1.29757470e+02 -5.31714938e+00 -2.24384342e+00 1.05711727e+02
1716.lowfreq: -10.8003 -0.0018 0.0008 0.0015 0.7582 8.5710 15.8974 30.9756 41.4839
frequency: 14.5404 30.4410 41.4096 58.5870 81.2640 98.7194 149.0321 157.2772 173.7050 211.1865 218.4259 230.9701 237.9375 257.0970 274.6290 282.6840 335.3334 372.9349 384.7138 394.2242 438.5023 572.3236 610.8322 690.6327 742.4548 747.9604 754.6030 799.3853 830.3997 861.6418 893.6709 927.7958 951.1663 963.5629 1001.6745 1047.7467 1087.4675 1106.2913 1146.0554 1161.8657 1172.8375 1222.3651 1246.3640 1270.5768 1295.0192 1322.6281 1326.9416 1355.2944 1358.8672 1388.9788 1392.4953 1457.3962 1469.1902 1474.4112 1475.1588 1478.6816 1483.4158 1488.5629 1644.4180 2950.4844 2965.3061 2973.4652 2974.4256 2981.2657 3011.8697 3034.0978 3037.1236 3071.1348 3074.0144 3075.0688 3087.9730 3107.2648
redmass: 6.8743 5.1162 3.9672 5.2422 2.2339 4.5062 2.9885 7.6284 2.4412 1.1693 5.5978 1.5604 3.7969 6.4365 7.7222 8.4062 3.4744 5.7231 2.6413 16.2726 2.3865 3.1844 8.6475 6.6558 1.7702 2.3462 11.5218 3.6432 2.8507 1.4173 1.9499 2.2524 2.6031 1.8478 1.4449 2.4144 2.2916 1.4981 2.1137 3.8486 2.8739 1.3931 1.1375 1.2570 1.1397 1.4752 1.5637 1.3010 1.4952 1.2130 1.2100 1.0900 1.0672 1.0537 1.0466 1.0473 1.0635 1.0783 10.6264 1.0812 1.0601 1.0469 1.0509 1.0365 1.0971 1.0581 1.1012 1.1010 1.0993 1.0992 1.1000 1.1096
irintensity: 0.0124 0.1694 1.0122 0.4309 0.6793 0.1643 0.1956 0.3184 0.3168 0.1133 0.5052 0.9024 3.6937 2.1145 0.8009 2.2228 3.3046 6.6746 2.1626 3.2861 2.0724 23.8701 112.6228 37.7964 38.1569 73.8913 57.8873 21.3419 7.4681 12.4220 2.5891 58.2868 37.1804 47.1909 0.4422 4.2420 4.9492 3.8677 9.3686 187.6635 81.2315 7.4620 10.5648 4.3477 0.7101 4.2426 3.6741 0.2643 3.9364 10.6274 20.9544 19.3924 0.2049 1.7406 18.0110 7.2698 6.0480 22.8470 148.4447 14.9510 4.0399 22.1397 73.4900 31.5932 6.3105 29.1485 28.6126 65.4643 42.5963 47.3448 34.3725 10.9188
temp: 298.150 k
press: 1.00000 atm
elementType: 17 17 17 8 8 6 6 6 6 6 6 6 6 1 1 1 1 1 1 1 1 1 1 1 1 1
symmnumber: 1
zpe: 520424.8 jmol-1
zpe.correction: 0.198219 hartree
zpe.thermalcorrener: 0.214446 hartree
zpe.thermalcorrenthalpy: 0.215390 hartree
zpe.thermalcorrgfe: 0.151505 hartree
zpe.sumelectzpe: -1842.212888 hartree
zpe.sumelectthermal: -1842.196661 hartree
zpe.sumelectthermalent: -1842.195717 hartree
zpe.sumelectthermalfe: -1842.259602 hartree
dipole: -2.7581 -1.7630 -0.2940
dipole: 3.2866
quadrupole: -95.8898 -100.2320 -99.2805
quadrupole: 2.9557 0.9248 4.2097
quadrupole: 2.5776 -1.7645 -0.8131 2.9557 0.9248 4.2097
hfenergy: -1842.4111069 hartree
pointgroup: C01 [X(C8H13Cl3O2)]
dipole: -1.0433078 -0.7514383 -0.1372169 debye
dipolederiv: -0.2469397 -0.2430002 0.0703279 -0.2454787 -0.5877068 0.1045061 0.0502744 0.0779513 -0.1149955 -0.2987946 -0.0261563 0.1837161 -0.018025 -0.1314664 0.0319787 0.2251242 0.0201033 -0.6667815 -0.4416932 0.298524 0.090013 0.313273 -0.4832514 -0.1179517 0.0452116 -0.0958493 -0.1583702 -1.1226675 -0.5217356 -0.1319449 -0.7105749 -0.8788666 -0.0012554 -0.173889 -0.030442 -0.3512486 -0.5429656 0.0643234 -0.2096462 -0.2168905 -0.648679 0.1529807 -0.0457417 0.3374631 -0.5321545 0.0752595 0.014627 0.0209204 0.0142839 0.0874354 -0.0073298 -0.048764 -0.0216483 0.0929231 0.1397022 0.039179 -0.0104071 0.0240148 -0.0298697 0.0164144 0.0412334 0.0251758 0.019447 0.7417768 0.2408919 0.0769644 0.1446298 0.2639623 0.0723222 0.2508933 0.2171082 0.2215646 0.1613499 0.0262153 0.0433803 0.0515808 0.0105709 0.0142116 0.0217478 0.0006508 0.0606497 0.0375658 0.0223419 -0.0102283 0.0564348 -0.0069624 0.0717944 0.0136835 0.0378883 -0.013634 0.0745598 0.0462402 -0.0117025 0.0365842 -0.0330866 -0.0269343 -0.0136909 -0.0071201 0.0661478 1.0388188 0.346546 0.4538784 0.7620421 1.075787 -0.219233 0.2978107 -0.3782716 0.5636104 0.8484718 -0.0658191 -0.4838928 -0.0292614 1.2947641 0.0107803 -0.5454806 -0.0292789 0.9016221 -0.1045816 -0.0777984 -0.1150794 -0.0375369 0.0365445 -0.0274319 -0.0658126 -0.0329077 -0.0529163 -0.0951122 -0.0102081 0.1350256 0.000044 0.0545551 0.0152573 0.1223873 0.019841 -0.0479592 -0.0497389 -0.0523994 -0.1133251 -0.0545755 0.0012418 -0.0267334 -0.1073392 -0.0208158 -0.0056902 0.0244532 -0.0773929 0.0003711 -0.0180238 0.0463887 0.13015 -0.0581149 0.0380691 -0.0128785 -0.036796 0.0334924 0.0101553 0.0309378 -0.0962018 -0.1084198 -0.0423173 -0.0679503 0.0726007 -0.0734172 -0.0499482 -0.128761 -0.085389 -0.0241519 -0.0857043 -0.1053339 -0.0499062 -0.0216539 -0.0341575 -0.0083706 0.1193355 -0.0154297 0.0461063 0.0016293 0.1130042 -0.0007572 -0.0226886 -0.0041429 -0.0170117 -0.1119682 -0.0532352 0.0710261 -0.0561874 -0.0948295 -0.0190303 0.011475 0.0859863 0.0689185 0.0125008 0.0528808 -0.1737172 -0.0361896 0.0021765 -0.0942816 0.0398701 -0.1048018 -0.0335815 0.1302465 0.0121198 0.0895472 0.0020424 0.1187544 0.0344392 0.0007227 -0.0861624 0.0076743 0.126271 -0.0476398 0.0573839 0.0325332 0.1497584 -0.0225898 -0.0126668 -0.0540193 -0.0932027 -0.1080401 -0.0474676 0.0399822 -0.0499431 -0.0881555 -0.0812648 0.002858 0.0680461 0.0676507 -0.0381108 0.0807021 -0.0813357 0.1067132 -0.0625907 0.1434239 -0.0398533 unknown
polarizability: 127.0350006|2.0782515|128.8922825|-3.1114071|-5.3652436|105.7955574 unknown
InChI: InChI=1S/C8H13Cl3O2/c1-3-4-6(2)5-13-7(12)8(9,10)11/h6H,3-5H2,1-2H3
charge 0 multiplicity 1
26 atoms
Cl 3.027476 1.966985 0.203029
Cl 1.60481 0.260011 2.253166
Cl 3.423135 -1.02701 0.17713
O  0.382041 -1.023857 -0.225603
O  0.643239 1.029482 -1.315428
C  -2.088516 -1.344092 -0.093446
C  -2.428158 0.078786 0.426778
C  -0.853838 -1.370768 -1.013506
C  -2.825404 1.101602 -0.663283
C  -1.940246 -2.353617 1.070032
C  -3.269236 2.45324 -0.0619
C  0.984184 0.181599 -0.469612
C  2.20228 0.345636 0.48459
H  -2.928354 -1.677457 -0.743446
H  -3.268284 -0.017683 1.14431
H  -1.572804 0.470065 1.014845
H  -0.936874 -0.665355 -1.857478
H  -0.650095 -2.390493 -1.38006
H  -3.64983 0.680358 -1.27522
H  -1.973973 1.278702 -1.348161
H  -1.105348 -2.064947 1.732886
H  -1.739411 -3.375917 0.698304
H  -2.864433 -2.387143 1.674582
H  -4.144481 2.327719 0.603427
H  -2.454788 2.905417 0.534581
H  -3.545191 3.173839 -0.853115
