program: Gaussian 09
title: 000244461
version: EM64L-G09RevD.01
frameworkgroup: C1[X(C12H22O4S)]
method: RPBEPBE
basis: SDD
operation: Freq
keyword: #p
keyword: freq=noraman
keyword: PBEPBE/SDD
title: #p freq=noraman PBEPBE/SDD
converged: YES YES NO NO
title: Mulliken charges:
elementType: S O O O O C C C C C C C C C C C C H H H H H H H H H H H H H H H H H H H H H H
charge: 0.150389 -0.264050 -0.264049 -0.244607 -0.244608 -0.634040 -0.634040 -0.477738 -0.477737 -0.233962 -0.233961 -0.381148 -0.381148 0.256764 0.256763 -0.678340 -0.678341 0.267907 0.268628 0.267911 0.268623 0.257603 0.257626 0.257603 0.257625 0.222336 0.222284 0.222336 0.222283 0.216247 0.216218 0.216247 0.216219 0.213048 0.226977 0.213053 0.213049 0.226977 0.213053
chargesum: 0.00000
title: Mulliken charges with hydrogens summed into heavy atoms:
elementType: S O O O O C C C C C C C C C C C C
charge: 0.150389 -0.264050 -0.264049 -0.244607 -0.244608 -0.097506 -0.097506 0.037491 0.037492 0.210658 0.210658 0.051317 0.051318 0.256764 0.256763 -0.025262 -0.025262
polarizability: 2.48637823e+02 -4.20675104e-06 1.42276714e+02 2.10883476e-01 -1.51883096e-04 1.10527520e+02
1716.lowfreq: -11.6550 -3.3887 -0.0011 0.0011 0.0018 1.5161 10.4535 10.7411 22.9074
frequency: 8.5582 10.1865 22.1954 23.0250 33.7201 44.4996 54.8032 55.5614 59.5015 62.8259 84.6906 92.2523 97.6057 141.8083 164.6001 184.6249 185.1041 217.7548 223.2812 223.2996 266.8175 304.8877 310.8441 324.7352 349.4106 476.9669 496.7324 551.8188 552.1784 629.7142 643.3390 732.4361 751.4536 755.2941 755.3237 769.0142 784.2632 874.2346 878.0222 878.0581 878.0886 889.1995 893.3360 952.3484 955.8940 967.6481 988.8387 1050.8713 1050.9956 1064.4940 1084.8680 1129.6083 1130.1941 1134.1669 1134.8890 1136.4476 1137.1648 1143.2060 1143.2221 1224.2802 1228.1190 1228.1226 1262.1655 1262.9443 1268.0372 1278.5793 1278.5930 1304.3107 1305.0078 1332.4659 1345.4250 1373.6009 1374.0759 1396.1367 1396.1479 1445.2959 1447.1212 1458.3900 1464.2739 1471.2499 1471.3106 1478.4917 1478.4991 1480.4222 1480.4243 1490.0303 1490.0460 1635.9009 1637.1104 2979.9668 2979.9884 2998.1345 2998.1655 3002.0110 3002.0442 3005.2009 3005.2104 3028.8988 3031.5864 3043.9727 3043.9758 3051.8571 3051.9062 3065.7222 3065.7237 3084.5371 3084.5522 3086.0175 3086.0464 3102.6170 3106.8593
redmass: 5.0138 6.2560 2.1049 4.8406 4.0453 4.7283 1.9506 1.8461 2.0875 4.7115 2.5754 2.8983 5.3563 5.1045 4.5289 3.0335 3.0079 5.3560 1.1007 1.1039 6.5608 3.6598 4.7800 6.0538 3.6419 4.4401 4.2708 2.7148 2.7095 7.6321 7.7106 5.7733 6.8976 1.0762 1.0761 1.2554 1.2904 6.3076 1.5963 1.1518 2.2195 2.2755 2.4101 3.4730 3.5660 1.5030 1.5518 2.8678 2.8520 3.8382 4.0774 2.8802 1.2257 1.2246 2.7361 2.1774 2.3301 1.4736 1.4720 1.2717 1.2559 1.2559 1.2823 1.1917 1.1390 1.0988 1.0989 1.3249 1.3340 1.7202 1.6100 1.5704 1.5850 1.2140 1.2144 1.0855 1.0884 1.0952 1.0932 1.0724 1.0723 1.0624 1.0624 1.0412 1.0412 1.0845 1.0845 9.6397 9.6660 1.0360 1.0360 1.0597 1.0597 1.0608 1.0606 1.0578 1.0578 1.0564 1.0568 1.1018 1.1018 1.0996 1.0994 1.1045 1.1045 1.0991 1.0991 1.1050 1.1050 1.1084 1.1087
irintensity: 1.1737 0.0000 0.6243 0.3795 0.0001 0.9453 0.0002 0.0000 0.0598 0.2996 0.0013 4.6859 0.6761 0.0000 12.5193 0.0021 19.5921 0.2024 0.0021 0.0006 0.1555 30.3864 0.2981 10.3425 0.2640 1.2583 0.1884 2.1930 0.0033 4.7186 22.2866 29.6821 3.7657 0.0097 13.7959 0.0018 24.5675 3.0543 8.3328 4.4747 14.6778 0.7156 3.8612 138.0668 0.8464 0.0019 0.6600 27.7945 0.0023 119.4750 1.8169 718.5547 0.3070 24.6415 2.5754 33.0871 8.7371 0.0034 0.8050 60.0905 0.0033 1.0069 4.8136 1.8042 0.0440 0.0000 0.0063 2.2104 0.6197 265.8619 1.7487 10.4961 3.0823 16.4116 4.9436 3.0135 55.0588 1.0351 7.6871 5.9099 0.0050 1.6348 1.6976 0.0576 26.6150 5.3413 34.3986 38.6365 288.4361 50.8909 14.0939 7.0557 0.0857 0.0529 28.0378 5.5771 76.7627 28.8443 0.4823 0.4943 0.6500 3.5196 0.0058 0.0021 0.2048 24.9944 57.7768 0.2121 183.9408 38.9571 0.0000
temp: 298.150 k
press: 1.00000 atm
elementType: 16 8 8 8 8 6 6 6 6 6 6 6 6 6 6 6 6 1 1 1 1 1 1 1 1 1 1 1 1 1 1 1 1 1 1 1 1 1 1
symmnumber: 1
zpe: 853131.8 jmol-1
zpe.correction: 0.324941 hartree
zpe.thermalcorrener: 0.347446 hartree
zpe.thermalcorrenthalpy: 0.348390 hartree
zpe.thermalcorrgfe: 0.264946 hartree
zpe.sumelectzpe: -1168.064693 hartree
zpe.sumelectthermal: -1168.042188 hartree
zpe.sumelectthermalent: -1168.041244 hartree
zpe.sumelectthermalfe: -1168.124688 hartree
dipole: 0.0000 1.6199 0.0002
dipole: 1.6199
quadrupole: -68.0417 -123.1083 -108.1305
quadrupole: -0.0001 0.1552 -0.0003
quadrupole: 31.7185 -23.3481 -8.3703 -0.0001 0.1552 -0.0003
hfenergy: -1168.3896338 hartree
pointgroup: C01 [X(C12H22O4S1)]
dipole: -0.0000458 -0.6373334 -0.0000369 debye
polarizability: 248.6376848|-0.0075781|142.2767144|-0.252009|-0.0013019|110.5276578 unknown
InChI: InChI=1S/C12H22O4S/c1-3-7-15-11(13)5-9-17-10-6-12(14)16-8-4-2/h3-10H2,1-2H3
charge 0 multiplicity 1
39 atoms
S  -0.000107 -1.10832 0.000137
O  5.139385 -0.440092 -0.006441
O  -5.139498 -0.439351 0.006475
O  3.919941 1.546367 0.027887
O  -3.919774 1.546936 -0.027875
C  1.427373 0.134938 -0.001523
C  -1.427403 0.13515 0.001579
C  2.751917 -0.640251 0.004052
C  -2.752059 -0.639847 -0.003883
C  6.407763 0.353195 0.000887
C  -6.407767 0.35411 -0.000925
C  7.563653 -0.647243 -0.014617
C  -7.563793 -0.646171 0.014554
C  3.953424 0.29398 0.009752
C  -3.953434 0.294554 -0.009695
C  8.929613 0.075366 -0.008627
C  -8.929654 0.076624 0.008492
H  1.342227 0.768483 -0.899612
H  1.33919 0.774696 0.891778
H  -1.342175 0.768831 0.899564
H  -1.339114 0.774747 -0.891828
H  2.819183 -1.301675 0.888935
H  2.827562 -1.303865 -0.878183
H  -2.819429 -1.301386 -0.888671
H  -2.827792 -1.303326 0.878447
H  6.416693 0.991039 0.904429
H  6.412561 1.013907 -0.886075
H  -6.416573 0.991933 -0.904483
H  -6.412512 1.014843 0.886022
H  7.475708 -1.288779 -0.911212
H  7.47989 -1.311505 0.865683
H  -7.475972 -1.287699 0.911166
H  -7.480085 -1.310463 -0.865728
H  9.048354 0.705369 0.892652
H  9.757591 -0.655066 -0.019583
H  9.04437 0.727675 -0.894411
H  -9.048273 0.706622 -0.892806
H  -9.757732 -0.653694 0.019431
H  -9.044358 0.728969 0.894257
