program: Gaussian 09
title: 000244460
version: EM64L-G09RevD.01
frameworkgroup: C1[X(C13H22O6)]
method: RPBEPBE
basis: SDD
operation: Freq
keyword: #pfreq=noraman
keyword: PBEPBE/SDD
title: #p freq=noraman PBEPBE/SDD
converged: YES YES NO NO
title: Mulliken charges:
elementType: O O O O O O C C C C C C C C C C C C C H H H H H H H H H H H H H H H H H H H H H H
charge: -0.266176 -0.268343 -0.263783 -0.264644 -0.226267 -0.225347 0.349705 -0.217921 -0.203460 -0.386780 -0.757769 -0.367712 0.266844 0.260322 -0.700131 -0.260694 -0.259671 -0.666422 -0.666200 0.268437 0.267575 0.251910 0.207198 0.214042 0.229297 0.282097 0.226768 0.201706 0.213659 0.206999 0.221604 0.238228 0.227001 0.226992 0.238006 0.221227 0.229915 0.250311 0.250186 0.229994 0.221300
chargesum: 0.00000
title: Mulliken charges with hydrogens summed into heavy atoms:
elementType: O O O O O O C C C C C C C C C C C C C
charge: -0.266176 -0.268343 -0.263783 -0.264644 -0.226267 -0.225347 0.349705 0.050515 0.064115 0.072328 -0.032333 0.060762 0.266844 0.260322 -0.057870 0.204536 0.205327 0.035031 0.035280
polarizability: 1.95067618e+02 -8.75258542e+00 1.69313504e+02 1.28315674e+00 1.84652399e+00 1.21469304e+02
1716.lowfreq: -9.8686 -3.4961 -0.0011 -0.0002 0.0003 5.7347 15.2426 18.2768 35.8924
frequency: 14.0443 17.3861 35.8006 38.9745 50.5985 61.4073 76.7777 79.8157 87.4488 105.6368 133.3133 161.8971 175.8096 202.0063 203.5638 222.6927 230.7725 236.5659 251.4209 253.2136 266.2768 308.4064 314.1583 323.0533 346.9956 372.4791 403.8433 450.9006 466.8618 499.0219 621.6571 624.1874 673.3977 693.6341 711.1297 714.4991 741.4043 756.1840 781.8814 788.4220 809.1556 818.1945 822.3075 871.9933 883.1425 894.1159 923.1536 949.4455 959.9102 1000.0758 1005.8862 1020.3287 1030.7899 1036.9325 1048.3648 1083.2283 1094.5472 1096.1003 1123.6286 1124.7636 1128.1269 1155.6761 1156.2589 1184.5348 1221.5947 1229.2562 1240.3017 1262.8698 1275.3846 1276.0486 1289.5962 1311.2537 1318.3908 1338.8888 1352.9462 1355.1968 1359.2246 1386.1480 1389.5251 1390.5022 1392.7836 1452.9606 1457.4733 1458.1038 1462.4885 1464.8955 1465.0578 1473.5112 1476.6776 1478.5928 1485.1585 1485.2937 1487.0595 1646.0863 1652.3391 2972.1375 2982.2026 2993.7525 2994.5412 2994.7256 3001.4874 3032.0774 3032.2748 3032.4206 3063.4050 3065.6464 3068.5523 3071.9967 3079.6662 3089.2027 3089.8995 3094.9645 3095.3060 3100.3711 3119.5426 3121.7963 3122.1199
redmass: 3.8931 4.4461 4.1302 3.3353 3.1523 3.3258 4.0903 3.3946 2.4020 2.8016 3.1875 3.3067 3.5180 1.7785 2.4058 1.4885 1.9154 1.1899 1.9510 2.3670 2.7884 2.8033 3.1117 3.4764 3.3708 3.6354 3.6396 3.2396 4.0466 3.6062 6.4902 6.5937 6.1631 6.6074 4.2943 4.5988 1.7181 1.9552 3.3845 1.7525 1.3316 3.2571 2.2598 1.2908 4.1191 1.9389 5.8964 2.4503 2.1805 3.0207 3.0517 2.9206 3.2232 2.7701 2.5829 2.1313 2.2394 2.1924 3.1484 3.3674 2.8210 1.6641 1.6632 2.2002 1.8108 1.2630 1.4548 1.6255 1.1191 1.1192 1.3091 1.2876 1.2953 1.3577 1.2931 1.3476 1.5256 1.2156 1.2426 1.2271 1.2299 1.0733 1.0925 1.0900 1.0635 1.0440 1.0441 1.0564 1.0450 1.0491 1.0513 1.0506 1.0786 9.3156 9.2302 1.0354 1.0599 1.0361 1.0361 1.0627 1.0365 1.0600 1.0618 1.0959 1.0867 1.0989 1.0865 1.0999 1.1015 1.0975 1.0975 1.1027 1.1027 1.0992 1.1009 1.1066 1.1065
irintensity: 0.1427 1.3962 0.4067 0.5774 0.5792 0.7351 0.1719 0.6631 0.0021 1.0229 2.2562 0.8502 0.1554 5.2241 6.0428 0.4291 1.1460 0.1774 2.1047 1.0384 3.0602 11.5726 4.6477 3.5618 18.6436 0.8756 1.7315 10.6329 15.1964 6.5016 8.2636 21.9957 5.0066 20.4689 1.0820 15.0725 11.5257 13.8076 28.8919 0.0452 6.2286 0.1014 0.9564 1.6290 14.0570 9.2921 1.6211 0.5769 10.6139 17.0996 32.8130 151.6230 184.0031 119.1679 25.2453 23.9697 56.3134 37.4994 114.5919 327.1064 120.4700 13.1083 20.3240 55.7420 22.9654 16.4070 49.4922 5.3930 4.7100 3.6795 4.6504 15.3407 26.2649 12.9472 1.9926 0.6484 13.7814 8.4079 49.2241 25.4080 21.5345 11.9252 16.5001 10.3124 6.1979 10.7503 19.5681 12.4698 10.3951 8.3576 20.1760 8.4359 12.4650 104.3992 217.5455 43.3282 18.7422 14.2232 14.1230 25.6666 22.1528 41.2511 22.7671 2.2242 9.9533 24.2539 9.9131 42.2035 57.1479 40.1523 31.2562 1.4694 1.4822 17.5087 2.6695 20.8430 36.7253
temp: 298.150 k
press: 1.00000 atm
elementType: 8 8 8 8 8 8 6 6 6 6 6 6 6 6 6 6 6 6 6 1 1 1 1 1 1 1 1 1 1 1 1 1 1 1 1 1 1 1 1 1 1
symmnumber: 1
zpe: 886862.9 jmol-1
zpe.correction: 0.337788 hartree
zpe.thermalcorrener: 0.360072 hartree
zpe.thermalcorrenthalpy: 0.361017 hartree
zpe.thermalcorrgfe: 0.283032 hartree
zpe.sumelectzpe: -958.396861 hartree
zpe.sumelectthermal: -958.374576 hartree
zpe.sumelectthermalent: -958.373632 hartree
zpe.sumelectthermalfe: -958.451616 hartree
dipole: -3.5234 2.4880 -0.1322
dipole: 4.3153
quadrupole: -100.1848 -106.0188 -116.7203
quadrupole: -4.4603 0.0263 -0.7118
quadrupole: 7.4565 1.6225 -9.0790 -4.4603 0.0263 -0.7118
hfenergy: -958.7346488 hartree
pointgroup: C01 [X(C13H22O6)]
dipole: 1.4568844 -0.8717622 -0.0024407 debye
polarizability: 196.218786|-6.8371944|167.5355109|-1.593667|-5.5027142|122.096129 unknown
InChI: InChI=1S/C13H22O6/c1-5-8-13(4)18-9(11(14)16-6-2)10(19-13)12(15)17-7-3/h9-10H,5-8H2,1-4H3
charge 0 multiplicity 1
41 atoms
O  -0.540855 1.103983 1.104817
O  -0.99537 0.369819 -1.108844
O  3.003689 0.898099 0.592647
O  1.01422 -2.58236 -0.585608
O  1.627725 2.560412 -0.305314
O  -1.170706 -2.280469 0.187259
C  -1.563292 1.193109 0.009758
C  0.660917 0.449882 0.613935
C  0.178961 -0.351274 -0.651251
C  -2.853456 0.564879 0.557901
C  -1.686429 2.628689 -0.49842
C  -4.026973 0.562266 -0.447515
C  1.771357 1.445803 0.240315
C  -0.115429 -1.818647 -0.295027
C  -5.249838 -0.197902 0.109155
C  4.221394 1.69186 0.223395
C  0.951373 -4.037422 -0.228545
C  4.633026 1.408502 -1.223332
C  1.33042 -4.251831 1.238901
H  1.042146 -0.212964 1.407673
H  0.927775 -0.337366 -1.460246
H  -2.619684 -0.472173 0.857271
H  -3.135009 1.125027 1.471351
H  -2.174853 3.258383 0.265421
H  -2.294861 2.651501 -1.41823
H  -0.685769 3.032857 -0.716603
H  -3.689697 0.087612 -1.388934
H  -4.321581 1.600648 -0.696562
H  -6.089907 -0.189593 -0.609539
H  -5.607203 0.256791 1.052827
H  -4.993377 -1.252571 0.320697
H  3.99775 2.761805 0.37922
H  4.97754 1.349831 0.947318
H  1.674381 -4.500569 -0.918169
H  -0.068925 -4.402011 -0.440923
H  5.584801 1.925324 -1.446181
H  4.782174 0.327172 -1.386025
H  3.870552 1.777582 -1.929603
H  0.583507 -3.795814 1.910254
H  2.322489 -3.820333 1.457033
H  1.370217 -5.33514 1.456923
