program: Gaussian 09
title: 000244457
version: EM64L-G09RevD.01
frameworkgroup: C1[X(C10H19ClO2)]
method: RPBEPBE
basis: SDD
operation: Freq
keyword: #p
keyword: freq=noraman
keyword: PBEPBE/SDD
title: #p freq=noraman PBEPBE/SDD
converged: NO YES NO NO
title: Mulliken charges:
elementType: Cl O O C C C C C C C C C C H H H H H H H H H H H H H H H H H H H
charge: -0.016011 -0.273720 -0.214069 0.329577 -0.441498 -0.017897 -0.371671 -0.745016 -0.729479 -0.733107 -0.722466 0.347430 -0.692347 0.193346 0.207846 0.188594 0.222358 0.272542 0.227228 0.215505 0.207450 0.212332 0.233846 0.207308 0.189235 0.208927 0.264011 0.212047 0.227715 0.208423 0.292018 0.289544
chargesum: 0.00000
title: Mulliken charges with hydrogens summed into heavy atoms:
elementType: Cl O O C C C C C C C C C C
charge: -0.016011 -0.273720 -0.214069 0.329577 -0.040305 0.170696 0.123229 -0.094833 -0.075994 -0.070934 -0.074281 0.347430 -0.110785
polarizability: 1.42201186e+02 -8.32106137e+00 1.25928595e+02 -3.66213927e+00 -2.01554564e+00 9.98892852e+01
1716.lowfreq: -13.0679 -0.0013 -0.0007 0.0005 6.0828 10.9174 17.7676 26.8423 48.6877
frequency: -8.2249 24.7306 48.6434 78.5128 96.7208 119.7265 166.6815 198.9368 216.1906 223.3879 229.5351 258.1256 261.7630 276.6276 286.3220 303.5355 307.1290 359.7532 388.9193 394.2601 415.7701 497.0155 541.7110 577.0841 638.9251 712.8174 737.5127 795.3656 832.1976 852.5161 889.7075 909.0069 913.8745 920.2520 932.3820 943.3014 960.3462 974.4798 1002.4039 1019.2776 1093.2372 1096.2890 1108.9025 1157.7323 1173.0430 1195.9264 1203.2735 1226.5616 1281.6503 1282.4486 1295.6940 1313.9563 1337.1157 1351.8763 1367.6805 1373.6315 1383.1516 1395.0739 1404.3818 1423.9062 1454.2919 1458.7855 1465.6362 1471.1233 1472.8057 1474.8711 1487.7986 1491.3584 1498.2660 1501.1148 1668.5768 2941.5561 2964.2170 2971.5942 2974.1015 2975.4540 2978.8359 3009.0575 3021.4496 3056.2572 3059.0123 3061.0928 3064.1346 3069.3166 3080.6575 3085.8526 3086.5530 3090.6326 3110.2880 3140.3718
redmass: 4.5569 6.4696 4.3790 3.2367 2.9926 3.1248 3.0070 2.1675 1.2349 4.6470 1.5770 2.3474 2.5761 1.1912 1.3952 2.2329 1.9991 1.9511 2.2352 1.9124 2.4470 3.2486 3.5279 2.4189 5.9505 3.6846 6.2532 2.9714 4.3992 1.9451 2.2398 1.8145 1.8437 1.1892 1.6149 3.1619 1.4503 1.7208 1.6649 1.4648 1.5700 1.7669 2.6192 1.2195 2.2600 2.1702 1.9283 2.0792 1.5862 1.3788 1.3652 1.4771 1.3993 1.3700 1.3154 1.1962 1.2049 1.2150 1.2030 1.0886 1.0769 1.0655 1.0536 1.0649 1.0494 1.0577 1.0571 1.0522 1.0557 1.0547 10.1079 1.0775 1.0628 1.0362 1.0359 1.0380 1.0384 1.0996 1.0607 1.0986 1.0581 1.0988 1.0986 1.0984 1.0997 1.0994 1.0975 1.0992 1.1040 1.1066
irintensity: 2.9831 1.9276 0.4650 3.9115 2.4571 0.4953 0.4067 0.2647 0.1154 2.3031 0.7221 1.9278 3.1474 0.7014 0.5741 3.2237 2.5480 0.1780 0.8376 2.0195 5.6338 2.2178 6.0424 2.8620 9.0486 1.5869 26.2516 0.1568 5.2314 7.6987 6.6625 8.1393 9.6753 1.0749 29.4362 65.8491 2.4737 15.1055 8.8324 2.7779 10.4039 20.9747 286.7366 47.4150 18.9105 0.9819 3.6633 11.2193 12.8713 21.1861 3.9466 5.9406 5.1280 8.6809 2.7230 14.8889 21.2965 16.9413 16.2314 31.5465 6.1343 1.1468 6.1379 4.5669 4.8527 15.2144 10.3307 2.6509 29.0750 19.4683 149.0650 10.3837 57.3323 30.0312 33.6220 25.0525 29.6734 33.3871 33.1774 36.8669 6.5692 78.2368 4.8612 74.2732 11.2274 11.3800 60.8688 34.2670 6.7960 2.0016
temp: 298.150 k
press: 1.00000 atm
elementType: 17 8 8 6 6 6 6 6 6 6 6 6 6 1 1 1 1 1 1 1 1 1 1 1 1 1 1 1 1 1 1 1
symmnumber: 1
zpe: 717496.5 jmol-1
zpe.correction: 0.273280 hartree
zpe.thermalcorrener: 0.288690 hartree
zpe.thermalcorrenthalpy: 0.289634 hartree
zpe.thermalcorrgfe: 0.230361 hartree
zpe.sumelectzpe: -1001.893742 hartree
zpe.sumelectthermal: -1001.878332 hartree
zpe.sumelectthermalent: -1001.877388 hartree
zpe.sumelectthermalfe: -1001.936661 hartree
dipole: -2.3023 2.8735 -0.4373
dipole: 3.7080
quadrupole: -92.7380 -88.6374 -87.9654
quadrupole: 6.7117 -1.1366 3.2579
quadrupole: -2.9578 1.1429 1.8149 6.7117 -1.1366 3.2579
hfenergy: -1002.1670222 hartree
pointgroup: C01 [X(C10H19Cl1O2)]
dipole: -0.8477111 1.1868069 0.032397 debye
polarizability: 137.3514731|-9.3146732|127.0667967|-12.4822549|0.6412819|103.6007962 unknown
InChI: InChI=1S/C10H19ClO2/c1-8(2)5-10(3,4)7-13-9(12)6-11/h8H,5-7H2,1-4H3
charge 0 multiplicity 1
32 atoms
Cl 4.225703 -1.151665 -1.707945
O  1.233151 1.004155 -0.132411
O  2.025133 -1.116214 0.484006
C  -1.267691 1.035162 0.05374
C  -1.50371 -0.214889 -0.865396
C  -2.042268 -1.582922 -0.327066
C  0.076555 0.936629 0.821312
C  -2.372021 1.250229 1.123607
C  -1.226597 2.291999 -0.86327
C  -1.289477 -2.17364 0.89155
C  -3.575242 -1.597785 -0.088049
C  2.123561 -0.066943 -0.178817
C  3.234561 0.319861 -1.151423
H  -2.205784 0.103543 -1.663791
H  -0.541379 -0.409765 -1.38295
H  -1.861902 -2.28491 -1.170684
H  0.208293 1.814708 1.478902
H  0.163516 0.006787 1.405103
H  -3.365416 1.300049 0.644408
H  -2.395008 0.440188 1.8732
H  -2.209114 2.205651 1.658901
H  -2.219539 2.463519 -1.318084
H  -0.48895 2.169419 -1.675322
H  -0.951311 3.197406 -0.289333
H  -1.488352 -1.600844 1.817475
H  -1.630122 -3.209893 1.076463
H  -0.197105 -2.199667 0.731029
H  -3.925853 -2.635018 0.072264
H  -3.866024 -1.011604 0.800495
H  -4.121179 -1.188791 -0.959452
H  3.935974 1.01124 -0.658907
H  2.810897 0.7983 -2.045255
