program: Gaussian 09
title: 000244455
version: EM64L-G09RevD.01
frameworkgroup: C1[X(C10H17Cl3O2)]
method: RPBEPBE
basis: SDD
operation: Freq
keyword: #p
keyword: freq=noraman
keyword: PBEPBE/SDD
title: #p freq=noraman PBEPBE/SDD
converged: NO YES NO NO
title: Mulliken charges:
elementType: Cl Cl Cl O O C C C C C C C C C C H H H H H H H H H H H H H H H H H
charge: 0.147986 0.110948 0.107892 -0.238340 -0.192653 0.266749 -0.415103 -0.043011 -0.325230 -0.737319 -0.720814 -0.701554 -0.702069 0.530477 -0.761402 0.192448 0.210469 0.189062 0.234317 0.244720 0.220891 0.233465 0.210526 0.213104 0.244886 0.204584 0.216112 0.212486 0.219290 0.214650 0.197137 0.215297
chargesum: 0.00000
title: Mulliken charges with hydrogens summed into heavy atoms:
elementType: Cl Cl Cl O O C C C C C C C C C C
charge: 0.147986 0.110948 0.107892 -0.238340 -0.192653 0.266749 -0.012186 0.146051 0.153807 -0.072438 -0.058240 -0.053667 -0.074986 0.530477 -0.761402
polarizability: 1.56243154e+02 3.91902684e+00 1.44133372e+02 5.71942473e+00 2.82727566e+00 1.26969232e+02
1716.lowfreq: -6.5455 -5.2492 0.0018 0.0024 0.0024 6.6976 13.5107 35.8682 45.7868
frequency: 12.6104 35.5601 45.4423 48.8833 67.8973 103.3525 143.1779 154.6062 184.5311 189.5716 204.1311 222.0896 237.9493 239.8788 249.9765 265.2587 269.0670 272.6026 280.9022 313.1818 328.2696 366.8493 383.5110 392.0614 400.2261 423.6335 498.9117 571.5275 606.4991 684.8599 737.4451 754.9791 757.2548 798.0228 850.3456 872.0300 888.3746 911.6402 922.7383 939.4978 952.6786 959.8163 968.8303 1001.2510 1018.4763 1086.0069 1101.0160 1160.3773 1174.7377 1188.2562 1206.9732 1229.9761 1272.0439 1290.2791 1323.0234 1335.0065 1356.0121 1368.1184 1378.7257 1383.0576 1399.4898 1404.9479 1451.7716 1460.6991 1463.8016 1468.4038 1472.7914 1479.3864 1486.2459 1488.5434 1493.0818 1501.1116 1640.9705 2939.5280 2964.6501 2971.0742 2976.0656 2979.5281 2981.6875 3005.9255 3016.8098 3059.6415 3065.6064 3067.1573 3069.8363 3072.3992 3081.5634 3089.6893 3090.8224 3099.8567
redmass: 7.4809 4.3480 4.4960 5.1435 5.7558 4.8726 2.1305 5.4054 1.3893 3.2159 5.6824 3.3090 1.2511 2.4459 1.5272 1.7501 1.8964 4.7630 6.2090 2.7380 4.4995 1.9408 2.6801 9.3929 2.1131 2.6148 3.7673 2.3343 12.9997 6.5150 4.0633 12.1285 11.2052 2.8754 2.0807 4.2506 2.2495 1.2168 1.7705 1.5566 2.6405 1.5335 2.0657 1.7167 1.4328 1.7464 1.5669 2.1329 3.8218 2.2114 2.0687 1.9803 1.6561 1.4189 1.4691 1.4120 1.4794 1.2940 1.2097 1.2005 1.2021 1.2180 1.0701 1.0505 1.0751 1.0546 1.0501 1.0573 1.0554 1.0542 1.0578 1.0595 11.7683 1.0783 1.0639 1.0359 1.0365 1.0366 1.0381 1.0605 1.0997 1.0992 1.0991 1.0985 1.0988 1.0991 1.0998 1.1009 1.1013 1.0975
irintensity: 0.0306 0.1643 0.9700 0.5834 0.2361 0.1710 0.0859 0.3371 0.3004 0.9119 2.2207 2.6495 1.2412 1.3937 0.2141 0.0774 0.5252 1.3159 1.7414 2.8580 2.1794 1.2367 0.2005 1.4443 1.7192 7.1991 2.0203 1.4732 129.5673 28.3308 9.9302 52.1690 130.6107 4.3987 7.5582 5.1714 10.8702 1.3357 4.4544 23.9270 60.8847 14.2092 61.4976 8.9786 1.2969 0.1874 5.3568 94.3403 240.3818 1.2268 3.7904 7.7373 8.1392 5.1723 6.6763 4.8477 1.2433 1.8312 3.3624 32.0170 3.2991 28.7038 5.9774 4.4539 3.5378 5.3163 1.0004 3.4468 7.0477 46.5126 5.2582 32.1730 158.2466 11.4824 55.6538 26.0790 29.7954 28.7254 26.0298 18.2841 29.0117 28.0971 5.3834 75.2666 52.0383 52.7977 44.4974 12.5558 22.9014 31.1026
temp: 298.150 k
press: 1.00000 atm
elementType: 17 17 17 8 8 6 6 6 6 6 6 6 6 6 6 1 1 1 1 1 1 1 1 1 1 1 1 1 1 1 1 1
symmnumber: 1
zpe: 664687.6 jmol-1
zpe.correction: 0.253166 hartree
zpe.thermalcorrener: 0.272065 hartree
zpe.thermalcorrenthalpy: 0.273010 hartree
zpe.thermalcorrgfe: 0.204187 hartree
zpe.sumelectzpe: -1920.652137 hartree
zpe.sumelectthermal: -1920.633238 hartree
zpe.sumelectthermalent: -1920.632294 hartree
zpe.sumelectthermalfe: -1920.701116 hartree
dipole: 3.3603 0.9294 0.6318
dipole: 3.5432
quadrupole: -110.6882 -110.6007 -116.5174
quadrupole: 0.5897 -1.2681 -3.5628
quadrupole: 1.9139 2.0014 -3.9153 0.5897 -1.2681 -3.5628
hfenergy: -1920.9053032 hartree
pointgroup: C01 [X(C10H17Cl3O2)]
dipole: -1.3140273 0.3882348 -0.2567099 debye
polarizability: 156.1929244|-3.9106645|143.7399909|5.3733308|-4.4658186|127.412843 unknown
InChI: InChI=1S/C10H17Cl3O2/c1-7(2)5-9(3,4)6-15-8(14)10(11,12)13/h7H,5-6H2,1-4H3
charge 0 multiplicity 1
32 atoms
Cl 4.02426 -1.237206 0.685462
Cl 2.295568 -0.891172 -1.763797
Cl 3.469856 1.543729 -0.369361
O  0.50206 0.59848 0.125315
O  1.474014 -0.406602 1.993179
C  -1.888135 1.173455 -0.105036
C  -2.207097 -0.060222 -1.020356
C  -2.457901 -1.507114 -0.477882
C  -0.749296 0.91261 0.895802
C  -3.115264 1.628519 0.737535
C  -1.484981 2.349327 -1.041872
C  -1.172445 -2.274086 -0.070629
C  -3.538319 -1.635658 0.624632
C  1.509099 -0.027082 0.807394
C  2.757781 -0.166959 -0.110292
H  -3.105571 0.233081 -1.603293
H  -1.380797 -0.139924 -1.75585
H  -2.85722 -2.044454 -1.366123
H  -0.527554 1.816133 1.494909
H  -0.960622 0.072908 1.578064
H  -3.988742 1.777109 0.07714
H  -3.399405 0.897039 1.511617
H  -2.907346 2.593199 1.238783
H  -2.300299 2.565185 -1.756783
H  -0.575341 2.106521 -1.617428
H  -1.290607 3.271271 -0.461267
H  -0.746198 -1.916879 0.884232
H  -1.399574 -3.348477 0.064437
H  -0.39118 -2.188368 -0.847464
H  -3.810123 -2.698857 0.764981
H  -3.177667 -1.263716 1.601744
H  -4.459054 -1.08169 0.364804
