program: Gaussian 09
title: 000244443
version: EM64L-G09RevD.01
frameworkgroup: C1[X(C15H31NO)]
method: RPBEPBE
basis: SDD
operation: Freq
keyword: #p
keyword: freq=noraman
keyword: PBEPBE/SDD
title: #p freq=noraman PBEPBE/SDD
converged: YES YES NO NO
title: Mulliken charges:
elementType: O N C C C C C C C C C C C C C C C H H H H H H H H H H H H H H H H H H H H H H H H H H H H H H H
charge: -0.267564 -0.304894 -0.386109 -0.385827 -0.385305 -0.384643 -0.384086 -0.382092 -0.376936 -0.372566 -0.383957 -0.353466 -0.350992 -0.356469 -0.411033 -0.696675 -0.049621 0.193191 0.193612 0.194266 0.193563 0.194180 0.195113 0.192481 0.193126 0.192038 0.192524 0.192390 0.191717 0.193429 0.198349 0.189472 0.188860 0.190596 0.190496 0.187445 0.187930 0.221423 0.200272 0.194751 0.194469 0.261497 0.211705 0.209657 0.214990 0.209759 0.302780 0.166152
chargesum: 0.00000
title: Mulliken charges with hydrogens summed into heavy atoms:
elementType: O N C C C C C C C C C C C C C C C
charge: -0.267564 -0.002114 0.000694 0.002002 0.003988 0.000963 0.000476 0.002015 0.014843 0.005767 -0.002865 0.021909 0.070703 0.032751 0.062170 -0.062269 0.116532
polarizability: 2.31725215e+02 -2.36854132e+00 1.49538408e+02 -8.63748870e+00 -2.41765391e+00 1.45788586e+02
1716.lowfreq: -25.0878 -13.1766 -4.3859 -0.0014 0.0002 0.0015 8.9782 14.9797 15.5764
frequency: -19.6682 12.1721 15.0844 25.0063 31.2001 45.4426 57.5936 66.6496 80.9669 92.0139 106.2209 120.5365 125.8259 136.5788 143.3509 144.0502 156.1390 195.1379 224.9548 234.3451 262.8426 293.3207 310.8171 356.9194 404.0083 429.6882 476.5761 495.6008 532.4769 569.3847 706.0995 717.7736 718.5907 721.4127 727.6429 740.2724 763.2135 790.3784 831.9246 870.4658 887.1576 896.8751 911.2347 953.4281 963.0316 977.2213 987.4660 994.8785 1009.2193 1022.7612 1029.5381 1046.9344 1050.8959 1070.6599 1074.9007 1079.1415 1081.3950 1082.9260 1096.3536 1123.4934 1134.4087 1180.0021 1185.7892 1197.6908 1199.3892 1219.7235 1223.0649 1241.3647 1246.2862 1260.9726 1266.7873 1275.5542 1278.0075 1281.1162 1283.3117 1287.6018 1290.8009 1294.1681 1294.7485 1301.5316 1320.5103 1337.9420 1348.2916 1351.2092 1352.4391 1355.3242 1355.7284 1361.9922 1368.6104 1387.5471 1455.1626 1456.0189 1458.0452 1458.5195 1460.7607 1461.5928 1463.1870 1465.4192 1469.7300 1474.4846 1477.1375 1478.6023 1480.1455 1483.4897 1486.5955 1488.4581 1642.6135 2925.1822 2945.2955 2947.6265 2947.7350 2949.1078 2949.9540 2950.8142 2953.0144 2956.7181 2960.7346 2964.3655 2967.4095 2971.2801 2976.5070 2980.7163 2982.5010 2984.9780 2988.2540 2989.4329 2993.6409 3000.7952 3009.9270 3019.3198 3028.1664 3035.9212 3041.9382 3047.3785 3067.7400 3069.8911 3075.6487 3545.8017
redmass: 2.2840 4.4550 5.1520 2.9763 3.3904 2.0441 2.7454 2.9787 1.9760 2.5403 2.1957 2.1765 2.4347 2.7966 2.3299 2.4745 2.1854 3.4485 3.1528 1.1092 2.7399 2.8401 3.6425 2.6645 3.2885 3.0604 3.0597 2.9782 2.5029 1.1614 2.7331 1.0577 1.0692 1.0951 1.1360 1.1728 1.2169 1.3120 1.3546 1.4159 1.9127 2.6922 1.3406 1.2815 1.5605 4.8898 4.9139 1.2403 2.9970 3.3477 1.1666 2.3987 3.2004 2.6853 2.4757 2.0088 2.1543 2.2435 2.6277 2.7941 1.7714 1.9118 1.7555 1.5907 1.4420 1.4159 1.3775 1.3370 1.3322 1.2818 1.2857 1.0243 1.2106 1.0313 1.2442 1.0609 1.1285 1.1170 1.1232 1.2844 1.3548 1.4285 1.4862 1.5424 1.7132 1.6409 1.6360 1.3887 1.2254 1.2171 1.0919 1.1236 1.0754 1.0747 1.0730 1.0723 1.0649 1.0834 1.0893 1.0962 1.0436 1.2448 1.3205 1.1048 1.0974 1.0928 5.5926 1.0863 1.0585 1.0586 1.0585 1.0588 1.0592 1.0593 1.0595 1.0594 1.0590 1.0585 1.0587 1.0364 1.0623 1.0959 1.0961 1.0967 1.0916 1.0737 1.1000 1.1025 1.1039 1.1047 1.1048 1.1045 1.1042 1.1021 1.1006 1.0993 1.0989 1.0781
irintensity: 0.1162 5.7346 3.7712 1.4706 2.5565 0.8108 1.4870 0.5382 1.1417 1.3170 0.6332 0.5889 0.6083 1.4423 0.1731 0.7921 0.7298 2.0810 7.7943 0.0089 35.3927 1.4258 3.3604 5.1373 3.3109 1.5472 2.0373 0.0207 1.2916 123.7653 0.3799 21.4226 0.0065 9.2364 0.4879 5.7250 0.7192 5.3491 2.0608 3.8090 5.0568 2.9205 2.1525 1.0625 1.1076 0.2126 1.6718 0.3989 1.6539 0.8276 0.2339 1.0885 1.3085 0.5363 0.6375 0.0966 0.0106 0.2770 15.9852 12.7535 9.2381 1.2243 38.1030 1.3287 10.8244 7.7130 3.2709 6.1546 2.2351 6.3622 5.7358 0.0247 1.0136 0.7986 7.5919 0.1023 2.2319 0.0379 0.0330 5.5596 1.9229 0.2735 0.7646 0.2250 0.1382 0.6713 0.0176 15.5244 10.4207 11.1989 23.5686 29.9550 0.4475 0.5830 1.0412 0.4137 0.6449 0.2713 2.5917 2.3912 10.4534 51.5117 53.0311 7.2574 8.0434 39.5799 284.5107 119.0790 9.1134 0.2076 0.4142 1.0296 1.3832 1.1310 0.3292 3.7653 0.4713 139.3158 227.3072 38.9984 56.5957 0.4610 1.6618 3.2359 11.3259 22.7940 0.9330 0.2973 0.7817 0.1368 7.3599 2.2792 195.6055 227.1744 98.3707 55.8447 8.0770 11.5313
temp: 298.150 k
press: 1.00000 atm
elementType: 8 7 6 6 6 6 6 6 6 6 6 6 6 6 6 6 6 1 1 1 1 1 1 1 1 1 1 1 1 1 1 1 1 1 1 1 1 1 1 1 1 1 1 1 1 1 1 1
symmnumber: 1
zpe: 1142086.0 jmol-1
zpe.correction: 0.434998 hartree
zpe.thermalcorrener: 0.456916 hartree
zpe.thermalcorrenthalpy: 0.457860 hartree
zpe.thermalcorrgfe: 0.378553 hartree
zpe.sumelectzpe: -718.758938 hartree
zpe.sumelectthermal: -718.737019 hartree
zpe.sumelectthermalent: -718.736075 hartree
zpe.sumelectthermalfe: -718.815382 hartree
dipole: 3.4319 0.6010 -2.8553
dipole: 4.5046
quadrupole: -163.5725 -103.7524 -111.5010
quadrupole: -3.5573 23.4457 -0.7348
quadrupole: -37.2972 22.5229 14.7743 -3.5573 23.4457 -0.7348
hfenergy: -719.1939355 hartree
pointgroup: C01 [X(C15H31N1O1)]
dipole: -1.354679 0.1721717 -1.1296375 debye
polarizability: 231.8040746|-5.0217154|147.4418134|6.9379429|3.0914224|147.8063215 unknown
InChI: InChI=1S/C15H31NO/c1-2-3-4-5-6-7-8-9-10-11-12-13-14-16-15-17/h15-16H,2-14H2,1H3
charge 0 multiplicity 1
48 atoms
O  8.721579 -0.990805 0.799138
N  7.05877 -0.548466 -0.795577
C  -0.990307 0.110475 -0.400861
C  -2.303738 0.287327 0.39378
C  0.270562 0.490994 0.407597
C  -3.565313 -0.092342 -0.414021
C  1.584252 0.320522 -0.388062
C  -4.879335 0.092132 0.377956
C  2.843308 0.698351 0.424354
C  -6.140957 -0.285084 -0.431183
C  4.158952 0.536591 -0.370342
C  -7.456334 -0.09248 0.356639
C  5.411393 0.904582 0.4568
C  -8.717341 -0.467816 -0.455181
C  6.739091 0.815776 -0.331708
C  -10.027634 -0.266626 0.336455
C  8.015407 -1.339596 -0.188213
H  -1.034175 0.727957 -1.322653
H  -0.905311 -0.944054 -0.737773
H  -2.2604 -0.329621 1.315849
H  -2.388568 1.341941 0.730411
H  0.182871 1.544096 0.747986
H  0.316134 -0.129121 1.327339
H  -3.60597 0.521491 -1.338405
H  -3.48334 -1.148452 -0.746736
H  1.670521 -0.732226 -0.73036
H  1.539665 0.94317 -1.306356
H  -4.840102 -0.522042 1.302088
H  -4.960598 1.148137 0.711159
H  2.753858 1.748912 0.771558
H  2.890505 0.072441 1.339698
H  -6.062583 -1.342724 -0.760051
H  -6.176827 0.32563 -1.35787
H  4.237044 -0.5140 -0.721269
H  4.117321 1.173183 -1.280058
H  -7.535782 0.964908 0.686037
H  -7.423642 -0.703746 1.283032
H  5.480434 0.250931 1.34797
H  5.308414 1.943847 0.830703
H  -8.638856 -1.525388 -0.780768
H  -8.746918 0.140724 -1.382267
H  7.580955 1.129568 0.309412
H  6.70304 1.490703 -1.209629
H  -10.144841 0.789111 0.646401
H  -10.912931 -0.542181 -0.265942
H  -10.036394 -0.886605 1.252994
H  6.530645 -0.939891 -1.577752
H  8.105476 -2.339233 -0.67412
