program: Gaussian 09
title: 000244427
version: EM64L-G09RevD.01
frameworkgroup: C1[X(C14H21N2O4P)]
method: RPBEPBE
basis: SDD
operation: Freq
keyword: #p
keyword: freq=noraman
keyword: PBEPBE/SDD
title: #p freq=noraman PBEPBE/SDD
converged: YES YES NO NO
title: Mulliken charges:
elementType: P O O O O N N C C C C C C C C C C C C C C H H H H H H H H H H H H H H H H H H H H H
charge: 1.395201 -0.466916 -0.598598 -0.263383 -0.242035 -0.802222 -0.748128 -0.094484 -0.337039 -0.354619 -0.573689 -0.300321 0.470350 0.213397 -0.396840 -0.388270 -0.235865 -0.251407 -0.258132 -0.252670 -0.664570 0.273444 0.206416 0.230123 0.365329 0.199792 0.233803 0.362186 0.225532 0.236614 0.208804 0.234460 0.236089 0.280217 0.223565 0.238463 0.226463 0.237235 0.228941 0.252134 0.227728 0.222903
chargesum: 0.00000
title: Mulliken charges with hydrogens summed into heavy atoms:
elementType: P O O O O N N C C C C C C C C C C C C C C
charge: 1.395201 -0.466916 -0.598598 -0.263383 -0.242035 -0.436893 -0.385942 0.178961 0.099499 0.078976 -0.111542 0.142943 0.470350 0.213397 -0.160751 -0.108053 -0.012300 -0.012944 0.205565 -0.023729 0.038194
polarizability: 2.13110427e+02 1.92371127e+01 1.92252740e+02 -8.39446574e+00 1.32441298e+01 1.69142230e+02
1716.lowfreq: -7.1774 -4.6343 -0.0009 0.0011 0.0014 6.1638 10.5890 13.9386 28.3527
frequency: 8.8378 13.3959 28.3248 40.1468 52.3541 64.7849 71.3825 87.7848 96.7757 112.4905 144.8122 158.0987 197.4317 206.6776 230.4038 247.4826 252.1074 274.2958 298.5152 313.2352 319.7081 338.2023 367.5492 386.0019 406.0211 415.4006 428.0037 435.2795 483.3530 496.9521 547.5968 555.2713 580.0192 616.3824 620.0024 658.4719 698.4626 705.8584 727.2905 760.4271 775.8066 807.1110 817.7290 821.0889 847.1888 855.1686 877.6429 890.8467 906.0384 917.9041 942.0651 953.6972 974.4078 980.8753 990.0587 995.5626 1013.9040 1027.2116 1040.0703 1054.7844 1081.3404 1095.1039 1101.6468 1118.5225 1126.2327 1138.8842 1157.7603 1171.6137 1192.5808 1194.1320 1202.1801 1215.5649 1218.5453 1255.3701 1266.5960 1278.6189 1292.5677 1311.9315 1336.8426 1341.8155 1343.0532 1353.3394 1356.1559 1377.7691 1382.2314 1392.5228 1421.1192 1437.3573 1441.1328 1458.1799 1458.7888 1460.0136 1464.2689 1473.8643 1484.5289 1485.2015 1590.5281 1612.4335 1631.3002 2939.7901 2974.6221 2994.4913 2994.6707 3001.9235 3021.0753 3033.3393 3052.3597 3066.1506 3072.5010 3085.3062 3089.4315 3096.2316 3110.7825 3122.7484 3127.0910 3140.5462 3152.3132 3165.9726 3500.4063 3593.0560
redmass: 4.9215 4.4639 4.0395 3.8664 4.1477 4.6958 4.6086 3.6379 3.7478 4.1214 3.0259 4.2975 3.7519 1.5040 4.6524 4.9886 3.4062 3.6585 1.8483 2.9367 1.7409 2.6558 3.0518 5.7806 2.8829 4.9016 3.2205 5.1087 3.8570 3.3340 1.8299 4.9275 1.5198 6.3250 4.8670 5.3435 4.8495 1.9029 4.1000 1.8323 3.0522 2.4275 1.8670 3.0632 2.7502 1.3005 1.6150 2.6189 2.7224 2.0694 2.5863 2.4341 1.4392 2.8609 3.9054 1.4466 2.9786 2.2224 2.5792 9.8320 1.7447 2.1830 2.0582 2.8523 2.4095 2.6103 1.6871 1.0601 1.2136 1.1792 1.3607 1.2624 2.4269 1.5506 1.1811 1.1192 1.3422 1.2102 1.2467 1.2547 1.2522 1.2649 1.2780 1.3799 6.6994 1.2309 1.3264 1.0946 2.1519 1.0844 1.0988 1.1124 1.0472 1.0815 1.0683 2.1601 5.9242 5.9663 8.8785 1.0694 1.0661 1.0611 1.0363 1.0602 1.0839 1.0597 1.0938 1.1006 1.1025 1.1003 1.0973 1.1030 1.0873 1.1066 1.0874 1.0919 1.0957 1.1006 1.0749 1.0780
irintensity: 2.0313 0.9148 1.2130 1.1763 0.4777 2.4851 2.8218 1.0218 0.3665 0.1874 2.7020 1.8026 6.0327 1.9988 21.8539 9.8315 1.6602 7.5311 35.9488 5.4516 29.4824 25.2509 41.8281 53.0653 0.1826 5.0332 9.9960 14.9158 12.6213 12.2093 2.3156 6.8211 90.5101 5.8524 91.9564 61.6775 26.9322 78.3445 22.8806 53.6984 77.5265 19.7511 7.6702 24.1800 13.0140 8.8861 11.4087 36.4165 41.7601 5.4933 7.6099 12.1589 1.7953 2.8236 0.3679 1.4919 62.4110 8.5612 68.9869 78.7479 4.1206 42.1601 19.5183 74.6883 153.1145 219.2908 24.8718 2.2462 9.2642 7.9497 79.6731 11.1838 1.8320 112.9914 3.1302 4.8910 24.2015 6.4778 0.1809 17.8886 7.5636 18.9388 2.7261 16.2788 0.5209 25.0730 58.8583 10.7954 10.3605 9.4462 13.0824 10.7793 14.0786 6.1554 10.8244 22.0800 1.5222 7.8196 161.8961 49.1546 41.2169 37.2287 12.7945 22.9768 8.2622 28.8774 25.0743 35.3228 12.8758 32.5207 36.8043 1.1493 7.4730 26.7965 4.0049 23.2711 22.9080 14.6965 71.3273 37.1537
temp: 298.150 k
press: 1.00000 atm
elementType: 15 8 8 8 8 7 7 6 6 6 6 6 6 6 6 6 6 6 6 6 6 1 1 1 1 1 1 1 1 1 1 1 1 1 1 1 1 1 1 1 1 1
symmnumber: 1
zpe: 891165.3 jmol-1
zpe.correction: 0.339427 hartree
zpe.thermalcorrener: 0.361582 hartree
zpe.thermalcorrenthalpy: 0.362526 hartree
zpe.thermalcorrgfe: 0.284275 hartree
zpe.sumelectzpe: -1296.095577 hartree
zpe.sumelectthermal: -1296.073422 hartree
zpe.sumelectthermalent: -1296.072478 hartree
zpe.sumelectthermalfe: -1296.150729 hartree
dipole: -3.8960 0.5681 6.2346
dipole: 7.3737
quadrupole: -121.3013 -130.8310 -133.5722
quadrupole: 1.8894 9.6991 -8.0414
quadrupole: 7.2669 -2.2628 -5.0041 1.8894 9.6991 -8.0414
hfenergy: -1296.4350037 hartree
pointgroup: C01 [X(C14H21N2O4P1)]
dipole: -0.104186 -2.5946454 1.2934632 debye
polarizability: 176.0048785|0.6795993|209.0192681|-19.8155973|20.7604159|189.4812499 unknown
InChI: InChI=1S/C14H21N2O4P/c1-2-19-14(17)13(11-12-7-4-3-5-8-12)16-21(18)15-9-6-10-20-21/h3-5,7-8,13,15-16H,2,6,9-11H2,1H3
charge 0 multiplicity 1
42 atoms
P  1.487299 2.062606 -0.338532
O  3.173328 2.033722 -0.819118
O  0.839788 3.487238 -0.611966
O  -0.626911 -2.597109 -1.028993
O  0.520177 -1.536933 -2.763797
N  0.897349 0.674691 -1.198389
N  1.506077 1.556643 1.308389
C  -0.133228 -0.2614 -0.742956
C  2.492072 0.567284 1.79929
C  3.917928 0.859949 1.269283
C  -1.621826 0.27578 -0.794953
C  3.966985 0.897367 -0.271046
C  -2.00828 1.044701 0.459435
C  -0.020357 -1.504372 -1.633048
C  -2.393982 0.331167 1.626162
C  -1.963837 2.460943 0.511074
C  -2.725342 1.01361 2.817084
C  -2.292254 3.146752 1.704025
C  -0.673528 -3.867293 -1.827245
C  -2.673968 2.427905 2.860163
C  -1.873537 -3.867735 -2.776731
H  0.067973 -0.567237 0.30069
H  2.198233 -0.462212 1.498604
H  2.482655 0.598194 2.903193
H  1.133622 0.597178 -2.194022
H  4.607157 0.069564 1.627058
H  4.270498 1.82965 1.666162
H  0.915585 2.059415 1.969906
H  -2.291637 -0.597646 -0.903762
H  -1.719709 0.901181 -1.700003
H  3.587671 -0.05342 -0.70047
H  4.987469 1.08429 -0.643076
H  -2.442077 -0.765225 1.595515
H  -1.645108 3.029743 -0.368586
H  -3.02997 0.448269 3.705437
H  -2.245992 4.241056 1.725479
H  -0.751339 -4.649118 -1.055438
H  0.277899 -3.964841 -2.378628
H  -2.935267 2.961396 3.781177
H  -1.768717 -3.083419 -3.544808
H  -2.815807 -3.708788 -2.224628
H  -1.93749 -4.844544 -3.290937
