program: Gaussian 09
title: 000244421
version: EM64L-G09RevD.01
frameworkgroup: C1[X(C9H8ClNO4)]
method: RPBEPBE
basis: SDD
operation: Freq
keyword: #p
keyword: freq=noraman
keyword: PBEPBE/SDD
title: #p freq=noraman PBEPBE/SDD
converged: YES YES NO NO
title: Mulliken charges:
elementType: Cl O O O O N C C C C C C C C C H H H H H H H H
charge: -0.066500 -0.406529 -0.421610 -0.237438 -0.332777 -0.440735 0.560562 0.107602 -0.590810 0.195645 -0.364850 -0.314024 0.254217 0.169286 -0.669992 0.259859 0.309609 0.271995 0.330661 0.301324 0.301350 0.390759 0.392396
chargesum: 0.00000
title: Mulliken charges with hydrogens summed into heavy atoms:
elementType: Cl O O O O N C C C C C C C C C
charge: -0.066500 -0.015771 -0.029214 -0.237438 -0.332777 -0.110074 0.560562 0.107602 -0.330950 0.195645 -0.055241 -0.042029 0.254217 0.169286 -0.067318
polarizability: 2.28385913e+02 5.98917814e+00 1.42076786e+02 5.03772286e-02 -2.61439753e-02 5.37544989e+01
1716.lowfreq: -5.9360 -3.8863 -3.1118 -0.0017 0.0003 0.0016 31.3134 56.0121 74.8401
frequency: 31.2781 56.0019 74.8357 85.7621 110.9744 139.3374 156.9374 236.8569 237.8328 287.7913 298.6142 340.7512 390.3082 418.4637 450.2297 489.0616 531.2442 556.5341 569.5181 573.7051 628.5517 643.0419 685.0352 685.4539 724.9809 746.5939 759.1795 789.2731 847.8281 855.6743 881.0833 905.6513 907.4918 984.9379 995.3410 1027.0853 1123.8794 1153.1953 1174.1362 1185.6343 1221.5827 1239.9616 1260.3104 1309.6053 1320.3455 1378.0623 1403.9356 1418.9781 1450.0017 1495.9014 1517.4099 1583.2717 1591.2586 1611.0907 1658.3968 3022.8137 3070.3760 3152.3289 3153.0623 3169.0982 3205.3199 3449.6355 3532.0656
redmass: 8.7517 5.3335 3.6807 11.8730 7.0178 6.2187 11.3344 7.9168 5.5629 7.7334 4.8790 8.7071 10.7029 9.0986 2.8056 7.0679 5.3294 3.2444 6.5197 1.2446 3.9098 5.3570 6.3636 3.3015 5.1998 1.5604 2.0960 6.5978 1.1382 1.4301 1.7014 1.7375 5.8021 3.5884 1.3193 4.9217 1.7015 1.1109 1.6187 2.1120 1.8155 2.0031 1.1865 2.1239 2.1687 3.7292 7.1921 1.1112 2.9391 3.3398 2.2821 5.4459 3.5138 5.8276 5.2926 1.0688 1.0566 1.1093 1.0924 1.0908 1.0957 1.0765 1.0642
irintensity: 0.0001 0.0014 18.6782 0.1160 0.4208 0.3909 7.7009 2.7231 1.0964 1.5267 0.6768 21.2310 3.7222 24.6391 23.0708 11.6509 17.7749 1.0677 3.5123 111.4063 2.3841 30.0328 89.3628 54.9992 13.5159 21.7807 13.1581 0.0220 196.7040 23.5677 45.7401 17.2299 18.5219 16.9588 0.9037 297.1610 143.8502 0.4335 83.9732 11.2383 107.4247 15.9164 23.4255 179.2830 28.1675 478.9962 14.7147 12.3603 165.9172 123.8241 444.2593 52.3964 244.8761 262.6863 336.9042 284.4492 2.7928 0.4294 3.0837 1.2667 4.8303 100.7459 82.1629
temp: 298.150 k
press: 1.00000 atm
elementType: 17 8 8 8 8 7 6 6 6 6 6 6 6 6 6 1 1 1 1 1 1 1 1
symmnumber: 1
zpe: 424404.5 jmol-1
zpe.correction: 0.161647 hartree
zpe.thermalcorrener: 0.175302 hartree
zpe.thermalcorrenthalpy: 0.176246 hartree
zpe.thermalcorrgfe: 0.119588 hartree
zpe.sumelectzpe: -1162.418113 hartree
zpe.sumelectthermal: -1162.404458 hartree
zpe.sumelectthermalent: -1162.403514 hartree
zpe.sumelectthermalfe: -1162.460172 hartree
dipole: 0.5389 0.8588 -0.0049
dipole: 1.0139
quadrupole: -80.2242 -102.4531 -94.5040
quadrupole: -9.2252 0.0684 -0.0239
quadrupole: 12.1696 -10.0594 -2.1102 -9.2252 0.0684 -0.0239
hfenergy: -1162.5797606 hartree
pointgroup: C01[X(C9H8Cl1N1O4)]
dipole: 0.2590323 -0.2940264 -0.0746667 debye
dipolederiv: -0.3711212 -0.0796812 -0.0003708 -0.3529269 -0.583432 -0.0625409 -0.0560899 -0.0822121 -0.1637504 -0.8544251 0.4476846 0.1204382 0.416718 -0.8526999 -0.1196647 0.1144237 -0.1218828 -0.4275705 -0.6612475 -0.4272227 -0.0660906 -0.813759 -1.1251158 -0.0812062 -0.1414677 -0.1083852 -0.4264675 -0.7977512 -0.1824085 -0.0044502 0.6017228 -0.9017181 -0.1555212 0.1526916 -0.0986341 -0.3716285 -1.3097535 0.1663749 0.0996866 0.3135008 -0.7648067 -0.1009312 0.1284036 -0.090765 -0.3890827 -2.1676007 0.1488115 0.1635915 0.2345297 -0.4437713 -0.0485929 0.1812515 -0.0421832 -0.3048772 1.5596748 -0.0178085 -0.1044481 0.4846565 0.4492733 0.0260811 -0.0054443 0.0618852 0.1502215 -1.3903142 -0.300996 0.0348464 0.0130284 -0.3168859 -0.0497655 0.0960909 -0.0275242 -0.0801681 -0.7515688 0.3663174 0.1087903 0.1643479 -0.0788475 0.018455 0.0695162 0.003902 -0.2369699 1.0552298 -0.5811529 -0.1807416 -0.1687715 0.7199215 0.1299168 -0.0997009 0.1593447 0.1595937 -0.6719415 -0.2288325 -0.0112727 -0.441546 -0.2876783 0.0139071 -0.0534273 -0.0007936 -0.1962014 0.6842978 0.1855955 -0.0170969 -0.2551854 0.0557744 0.0424915 -0.1036074 0.0113553 -0.0597874 1.8279847 0.0698228 -0.1015565 -1.2298543 0.94427 0.2371949 -0.3608919 0.1438536 0.2502085 2.4282633 0.3411601 -0.0868491 0.4872796 1.3949956 0.1872232 -0.0584193 0.1974471 0.3033555 -0.0509732 -0.0300323 0.0078481 0.3577473 0.7422951 0.0961203 0.0864751 0.1236145 0.1637256 0.0512522 -0.0630026 -0.0029158 -0.0759303 -0.0034197 -0.031315 -0.0053833 -0.0322999 0.1782536 0.1400887 0.060305 0.0151222 0.0276137 0.0901535 -0.020864 0.0085296 -0.0234118 0.1822704 0.0952985 -0.0385527 -0.0034716 -0.0307412 0.0100229 -0.0256936 -0.0017919 -0.0251012 0.1477868 0.3417256 0.0878434 0.0141774 0.1514811 0.193711 -0.0296268 0.0263308 -0.0252462 0.282395 0.0686384 -0.0306792 0.0351181 -0.0373699 -0.0045881 -0.0472914 0.0725797 -0.0236309 0.0126262 0.0516248 -0.0113288 -0.0472807 0.0005968 -0.0280019 0.0293302 -0.0838873 0.0058929 0.0534434 0.4938153 0.0380416 -0.0010741 -0.023347 0.4405182 0.0153015 -0.0129669 0.011027 0.375099 0.2288029 0.079741 0.0279999 0.1762088 0.3500297 -0.0230081 0.0467852 -0.0162521 0.3975244 unknown
polarizability: 227.413987|9.0628283|139.0847539|-10.5314579|16.2485092|57.7184571 unknown
InChI: InChI=1S/C9H8ClNO4/c10-4-8(13)11-5-1-2-6(9(14)15)7(12)3-5/h1-3,11-12,14H,4H2
charge 0 multiplicity 1
23 atoms
Cl 4.616575 2.231592 0.007857
O  -2.408237 2.128012 0.474726
O  -3.935845 -1.788531 -0.185532
O  3.113674 -1.50205 -0.637185
O  -4.372038 0.437762 0.280864
N  2.091474 0.57331 -0.150313
C  0.70969 0.247478 -0.116416
C  -2.075693 -0.267678 -0.020044
C  -0.187474 1.305694 0.154767
C  -1.576242 1.063689 0.206081
C  0.228497 -1.079631 -0.342301
C  -1.150057 -1.312941 -0.290332
C  3.165869 -0.259989 -0.393267
C  -3.517659 -0.484014 0.039805
C  4.562526 0.372032 -0.366089
H  0.164298 2.32784 0.329776
H  0.934489 -1.884036 -0.549628
H  -1.54177 -2.320098 -0.459396
H  2.335225 1.555594 0.028993
H  5.040341 0.246354 -1.34857
H  5.167379 -0.111874 0.414496
H  -3.370932 1.787916 0.477283
H  -4.927788 -1.826828 -0.122773
