program: Gaussian 09
title: 000244419
version: EM64L-G09RevD.01
frameworkgroup: C1[X(C16H23NOS)]
method: RPBEPBE
basis: SDD
operation: Freq
keyword: #p
keyword: freq=noraman
keyword: PBEPBE/SDD
title: #p freq=noraman PBEPBE/SDD
converged: YES YES NO NO
title: Mulliken charges:
elementType: S O N C C C C C C C C C C C C C C C C H H H H H H H H H H H H H H H H H H H H H H H
charge: -0.072074 -0.239918 -0.037789 0.196580 -0.414147 -0.486523 0.456328 -0.721717 -0.786277 -0.248203 -0.356847 -0.396329 -0.304614 -0.290680 -0.408044 -0.411878 -0.267296 -0.244175 -0.244687 0.203400 0.239905 0.232618 0.274968 0.215852 0.211187 0.226304 0.227663 0.226535 0.218545 0.258229 0.229502 0.238807 0.265511 0.227155 0.207816 0.187521 0.226383 0.225340 0.250519 0.227634 0.225797 0.231100
chargesum: 0.00000
title: Mulliken charges with hydrogens summed into heavy atoms:
elementType: S O N C C C C C C C C C C C C C C C C
charge: -0.072074 -0.239918 -0.037789 0.196580 0.029159 0.021063 0.456328 -0.068374 -0.113535 -0.248203 0.130884 0.107989 0.130357 0.123223 -0.182704 -0.161359 -0.039662 -0.018378 -0.013587
polarizability: 2.00960715e+02 1.39655007e+01 2.27621711e+02 1.62822732e+01 1.97420565e+00 1.51568181e+02
1716.lowfreq: -23.3955 -10.9351 -0.0017 -0.0011 -0.0009 6.8605 12.1773 28.0817 38.0919
frequency: -10.3761 27.9493 37.3518 49.5478 58.6908 71.2658 131.1377 151.8375 172.8372 194.0284 219.1866 224.2907 277.6047 296.5007 306.0995 311.1893 326.4388 339.6694 357.4282 402.4420 405.7176 412.7003 419.8338 444.7664 461.4416 486.6551 515.7449 555.2316 560.7016 617.3939 622.4722 674.9211 706.6508 710.9390 773.5813 775.5121 795.8803 829.6717 833.9167 854.3435 867.9863 902.0076 911.0789 927.0528 938.1036 972.0650 977.3649 989.9593 996.6231 999.4203 1009.2524 1026.6727 1029.8885 1041.3927 1045.9021 1068.8294 1080.7567 1093.5011 1111.1072 1118.7999 1143.7264 1154.6532 1173.3796 1188.8313 1195.8558 1202.7289 1211.2242 1229.5072 1255.2524 1258.9753 1273.0746 1280.1422 1303.4271 1319.8071 1325.3334 1327.6998 1337.6796 1346.7159 1366.4817 1373.8572 1381.4842 1399.6321 1432.1283 1436.1172 1445.7927 1447.5392 1454.5745 1461.1078 1466.2559 1471.1783 1475.4189 1481.5411 1486.1402 1489.9264 1498.1416 1586.6879 1609.8256 2939.9851 2964.2618 2975.4129 2977.9401 2983.1238 2986.2322 2990.3079 2993.0617 3035.8628 3061.3319 3071.3312 3074.0042 3079.6908 3081.1791 3082.5560 3091.4322 3092.7229 3110.6490 3115.9927 3126.4368 3137.0291 3154.7572 3167.3527
redmass: 4.8100 5.3357 3.9606 5.6985 3.7649 4.2635 3.3071 3.0845 4.8204 2.7148 1.1147 2.3563 3.1934 2.7041 2.9160 1.3757 2.2037 2.1175 3.3344 2.4702 2.8226 3.0346 2.5512 2.8666 3.1595 4.3015 3.0019 3.0194 2.6815 6.2854 3.2032 4.0894 1.9050 2.8527 1.4448 1.8378 4.4121 1.6991 2.6715 1.2544 2.5162 2.5057 1.7388 1.5890 1.4976 1.9243 1.3871 5.4077 1.3354 1.7937 2.2749 2.5105 2.4632 1.9326 2.3107 3.3656 1.7524 1.8642 2.1841 4.5097 1.7002 2.2829 1.0519 1.0906 1.2987 1.9637 2.0603 1.6076 1.4805 1.4445 1.3308 1.5393 1.4836 1.3761 1.2611 1.3372 1.2284 1.3470 1.2632 5.5666 1.2523 1.2028 2.1930 1.5113 1.0981 1.1017 1.1066 1.1659 1.1194 1.2247 1.2709 1.3090 1.3476 1.1562 1.0593 5.8489 6.0329 1.0684 1.0676 1.0393 1.0529 1.0382 1.0611 1.0664 1.0668 1.0999 1.1022 1.0999 1.0997 1.0995 1.0985 1.0955 1.0953 1.0983 1.0865 1.0940 1.0865 1.0931 1.0949 1.0988
irintensity: 0.2359 0.6010 0.0500 3.1568 0.3738 1.3062 0.1089 2.2955 0.3796 4.4429 0.0111 0.0977 10.1590 1.7993 6.5191 0.1692 0.1038 0.1430 1.0334 1.6468 0.0318 0.6030 2.9991 0.3799 4.0165 4.6360 0.7344 17.8519 11.1512 0.0136 6.0805 1.1158 47.4668 16.6190 17.9696 28.2636 17.8506 0.5228 7.1307 0.5190 0.6658 0.9937 0.6119 12.0330 2.6653 39.1388 0.0401 0.9741 0.8100 14.9269 19.8006 11.6912 3.6947 5.2494 47.7787 30.1063 11.5703 21.6455 1.1994 11.0804 15.6553 0.3799 0.1077 3.1686 3.7086 8.7760 2.7529 34.3022 31.1697 24.7277 40.8788 73.8332 9.3724 0.2972 0.3782 7.1083 1.8373 2.0995 0.5362 5.2572 17.8325 15.8005 8.2965 98.6483 5.1652 7.7495 9.3331 21.8400 3.3694 33.3261 41.2307 6.7938 28.2138 13.4026 10.1190 1.6697 8.2670 58.3665 39.5136 16.1920 34.8405 17.6807 18.6061 38.6436 54.9158 17.2530 14.5444 10.9770 27.2805 47.5011 51.6576 34.6745 13.0738 31.5325 13.1730 2.8785 0.3672 30.1464 30.1329 14.7899
temp: 298.150 k
press: 1.00000 atm
elementType: 16 8 7 6 6 6 6 6 6 6 6 6 6 6 6 6 6 6 6 1 1 1 1 1 1 1 1 1 1 1 1 1 1 1 1 1 1 1 1 1 1 1
symmnumber: 1
zpe: 939701.6 jmol-1
zpe.correction: 0.357913 hartree
zpe.thermalcorrener: 0.376032 hartree
zpe.thermalcorrenthalpy: 0.376976 hartree
zpe.thermalcorrgfe: 0.311162 hartree
zpe.sumelectzpe: -1150.071321 hartree
zpe.sumelectthermal: -1150.053202 hartree
zpe.sumelectthermalent: -1150.052258 hartree
zpe.sumelectthermalfe: -1150.118072 hartree
dipole: -2.8381 -2.6626 0.1720
dipole: 3.8954
quadrupole: -126.4569 -132.1595 -120.5578
quadrupole: -6.8939 4.0341 4.9656
quadrupole: -0.0655 -5.7681 5.8336 -6.8939 4.0341 4.9656
hfenergy: -1150.4292342 hartree
pointgroup: C01 [X(C16H23N1O1S1)]
dipole: -1.1110389 -1.0516337 -0.0917474 debye
polarizability: 201.7120491|11.0395323|224.6732315|17.1742958|15.0766915|153.7653264 unknown
InChI: InChI=1S/C16H23NOS/c1-16(2,14-6-4-3-5-7-14)9-8-15(19)17-10-12-18-13-11-17/h3-7H,8-13H2,1-2H3
charge 0 multiplicity 1
42 atoms
S  3.010121 2.765472 -0.087272
O  3.477323 -2.452594 0.272778
N  2.481795 0.129459 -0.591778
C  -1.681315 1.379727 1.106566
C  -0.114827 1.361076 1.051918
C  0.482784 1.595845 -0.365802
C  -2.244475 0.176191 0.310488
C  -2.111225 1.251948 2.600472
C  -2.204637 2.740184 0.578831
C  1.994805 1.40015 -0.379926
C  3.935421 -0.171715 -0.614796
C  1.663886 -1.097654 -0.768084
C  4.269042 -1.220634 0.461467
C  2.044207 -2.138172 0.310041
C  -1.910766 -1.151412 0.703135
C  -3.095996 0.329486 -0.814223
C  -2.4024 -2.274329 0.003556
C  -3.591792 -0.791951 -1.52068
C  -3.247037 -2.100399 -1.118129
H  0.245395 0.393674 1.454458
H  0.278667 2.146956 1.725322
H  -0.030472 0.948372 -1.102755
H  0.301438 2.639644 -0.664436
H  -1.730792 2.112012 3.182555
H  -1.718046 0.330018 3.065332
H  -3.212529 1.232228 2.690102
H  -1.961036 2.906845 -0.485226
H  -1.745631 3.56296 1.156676
H  -3.301376 2.817953 0.694026
H  4.48244 0.771341 -0.43995
H  4.194585 -0.568312 -1.61599
H  1.874867 -1.52059 -1.770568
H  0.589865 -0.876608 -0.70135
H  5.322404 -1.535567 0.38931
H  4.075514 -0.799203 1.470865
H  1.765276 -1.750992 1.315326
H  1.523637 -3.092368 0.126093
H  -1.26902 -1.315526 1.577806
H  -3.386052 1.330321 -1.147779
H  -2.13458 -3.283738 0.337122
H  -4.248824 -0.639972 -2.384795
H  -3.632845 -2.969327 -1.662603
