program: Gaussian 09
title: 000244386
version: EM64L-G09RevD.01
frameworkgroup: C1[X(C17H14O6)]
method: RPBEPBE
basis: SDD
operation: Freq
keyword: #pfreq=noraman
keyword: PBEPBE/SDD
title: #p freq=noraman PBEPBE/SDD
converged: YES YES NO NO
title: Mulliken charges:
elementType: O O O O O O C C C C C C C C C C C C C C C C C H H H H H H H H H H H H H H
charge: -0.300707 -0.337373 -0.216185 -0.388671 -0.279576 -0.420522 0.188008 0.226005 0.130928 0.250453 0.164696 -0.577901 -0.069478 0.244906 -0.439685 0.350118 -0.336043 -0.356343 -0.382446 -0.361051 0.283358 -0.523169 -0.534110 0.275057 0.246455 0.264859 0.234258 0.224133 0.257765 0.381061 0.226833 0.208694 0.304143 0.224931 0.223478 0.253281 0.359835
chargesum: 0.00000
title: Mulliken charges with hydrogens summed into heavy atoms:
elementType: O O O O O O C C C C C C C C C C C C C C C C C
charge: -0.300707 -0.337373 -0.216185 -0.007610 -0.279576 -0.060687 0.188008 0.226005 0.130928 0.250453 0.164696 -0.302844 -0.069478 0.244906 -0.193229 0.350118 -0.071184 -0.122084 -0.158313 -0.103285 0.283358 0.216502 0.167579
polarizability: 3.81402668e+02 1.23315443e+01 2.59862490e+02 1.21041385e+00 4.88424679e+00 9.12575111e+01
1716.lowfreq: -4.5261 -2.0413 -0.0008 -0.0006 0.0002 4.9189 17.4930 31.7683 58.8386
frequency: 17.4746 31.7427 58.8232 72.3112 79.9764 96.8166 114.7262 143.1050 163.1275 167.3929 173.6936 207.7783 210.1458 226.1635 249.9654 267.8617 301.0439 311.1894 321.2135 325.6863 358.7589 385.2982 392.3814 404.0003 409.0455 430.8271 463.0475 482.9581 501.0990 534.3276 569.9133 588.0476 611.0521 613.3283 625.3011 634.8955 636.2408 669.2939 695.4068 721.0909 736.2727 777.8835 803.0642 813.1608 824.8130 839.6250 844.4391 862.1967 884.7576 892.9849 957.9920 960.0483 967.8129 994.2042 1007.2717 1054.8578 1080.3925 1108.2039 1112.4870 1116.6874 1144.9620 1155.6704 1159.5569 1177.1198 1183.2207 1188.6350 1246.2468 1255.5703 1261.0614 1280.3774 1306.4132 1312.5464 1325.1312 1396.0450 1397.2661 1421.0477 1431.2368 1436.2619 1436.7932 1448.9619 1468.3286 1470.8566 1478.7668 1497.3005 1499.5444 1539.8197 1573.1675 1588.3653 1607.1066 1626.2095 1631.6234 2964.1457 2975.3521 3054.8894 3091.8090 3120.8433 3127.0696 3134.1737 3151.6661 3176.7936 3180.7348 3187.2315 3188.2695 3404.5623 3579.1321
redmass: 3.5907 6.2078 5.0420 5.6540 3.8759 4.6057 3.2468 3.1821 3.2491 2.2207 4.0423 3.7685 2.3492 2.5966 5.6904 2.6428 6.6429 4.6741 5.9796 5.9524 4.8392 1.1587 6.8068 4.4977 2.8559 6.4735 7.1034 7.8532 2.9242 8.5373 6.9180 5.8483 5.7305 5.0642 1.1076 6.9420 4.4961 7.1493 4.8213 4.0062 4.1016 2.9295 6.5759 1.3047 6.1806 1.6634 2.0606 1.6931 7.3659 7.3253 1.3699 8.6907 1.3629 4.5965 2.8858 6.0282 4.4145 1.4494 1.2595 1.2605 1.3213 1.3740 1.4033 1.9199 1.3893 1.9918 2.6825 1.7681 2.5012 3.5732 2.7476 2.8110 1.8318 4.8288 2.3143 3.8868 1.6836 1.8066 2.2972 1.1970 1.0499 1.0965 3.5317 1.3371 1.9008 7.7497 9.1061 5.9490 6.8126 6.4511 7.6546 1.0329 1.0314 1.1042 1.1021 1.0905 1.1051 1.0997 1.0888 1.0952 1.0948 1.0912 1.0914 1.0626 1.0660
irintensity: 0.6501 0.5109 0.9705 0.6770 7.6748 0.4943 3.1001 0.4393 3.1025 2.3671 2.9056 2.5200 1.0016 1.7705 4.6790 1.8174 2.3660 2.2211 11.0369 12.3644 17.6156 147.1425 2.5037 3.5680 3.6759 7.2804 5.4056 9.5168 19.6596 22.4257 2.5852 8.0939 0.2108 2.0096 136.6397 0.8345 4.5620 14.7645 37.0933 0.1063 0.1053 5.9796 23.7974 14.4884 13.8830 48.6825 38.4170 39.5161 33.1107 23.1680 0.6328 5.0854 0.2008 15.6462 13.7190 103.7308 177.3523 126.1258 0.1029 48.7222 308.7015 10.7987 10.9261 145.8645 110.5402 22.2038 184.0472 16.1528 54.9756 86.7662 182.4979 16.3258 224.6649 16.0943 146.8750 121.4658 35.3316 98.8408 14.3584 47.1601 15.2706 46.4942 19.4823 40.6441 122.8228 241.0193 14.5296 98.7800 196.0288 94.6802 339.1483 56.7309 106.0125 43.3273 34.4440 22.4991 6.3470 20.5309 4.9231 6.5593 1.1531 1.9599 5.0640 85.0290 83.2628
temp: 298.150 k
press: 1.00000 atm
elementType: 8 8 8 8 8 8 6 6 6 6 6 6 6 6 6 6 6 6 6 6 6 6 6 1 1 1 1 1 1 1 1 1 1 1 1 1 1
symmnumber: 1
zpe: 718881.4 jmol-1
zpe.correction: 0.273807 hartree
zpe.thermalcorrener: 0.294465 hartree
zpe.thermalcorrenthalpy: 0.295410 hartree
zpe.thermalcorrgfe: 0.223676 hartree
zpe.sumelectzpe: -1105.871818 hartree
zpe.sumelectthermal: -1105.851160 hartree
zpe.sumelectthermalent: -1105.850216 hartree
zpe.sumelectthermalfe: -1105.921949 hartree
dipole: 3.4934 5.0339 1.9205
dipole: 6.4212
quadrupole: -127.1947 -115.7166 -136.6211
quadrupole: 13.0636 -4.6628 -3.8272
quadrupole: -0.6839 10.7942 -10.1103 13.0636 -4.6628 -3.8272
hfenergy: -1106.1456257 hartree
pointgroup: C01 [X(C17H14O6)]
dipole: 1.3849166 -2.086915 -0.3301632 debye
polarizability: 381.5436786|-11.7095587|254.3676885|0.546863|-29.9345048|96.6113021 unknown
InChI: InChI=1S/C17H14O6/c1-21-14-8-13-15(17(22-2)16(14)20)11(19)7-12(23-13)9-3-5-10(18)6-4-9/h3-8,18,20H,1-2H3
charge 0 multiplicity 1
37 atoms
O  0.525515 -0.572848 0.063281
O  -3.837001 1.879744 -0.237564
O  -3.768916 -2.755172 0.586821
O  -5.05685 -0.392758 0.201196
O  -1.140893 3.228157 -0.368938
O  6.919536 -0.669609 -0.025468
C  -1.523499 0.819531 -0.127534
C  -0.879237 -0.438015 0.070787
C  -2.955933 0.78689 -0.106353
C  1.338415 0.557883 -0.088885
C  -0.678994 2.037339 -0.255974
C  -1.564802 -1.645155 0.301989
C  -3.667938 -0.411039 0.153202
C  -2.972834 -1.639329 0.357565
C  0.764554 1.802198 -0.231613
C  2.77423 0.225114 -0.069317
C  3.203693 -1.12169 0.082896
C  3.76747 1.238455 -0.202864
C  4.571945 -1.450144 0.10049
C  5.134154 0.922613 -0.185721
C  5.540417 -0.42544 -0.033824
C  -3.787068 2.701064 -1.475141
C  -3.085991 -4.036661 0.795411
H  -0.980594 -2.556049 0.445296
H  1.390288 2.690748 -0.33397
H  2.454081 -1.910001 0.186796
H  3.474972 2.286175 -0.321224
H  4.882726 -2.496197 0.218378
H  5.899276 1.697266 -0.286996
H  -5.317731 0.566162 0.079864
H  -4.699814 3.315436 -1.438212
H  -3.800453 2.045717 -2.366717
H  -2.882924 3.328263 -1.44723
H  -2.428056 -3.997209 1.684822
H  -2.496124 -4.324961 -0.096047
H  -3.89326 -4.764137 0.960072
H  7.112638 -1.633439 0.088728
