program: Gaussian 09
title: 000244359
version: EM64L-G09RevD.01
frameworkgroup: C1[X(C23H23N3O)]
method: RPBEPBE
basis: SDD
operation: Freq
keyword: #p
keyword: freq=noraman
keyword: PBEPBE/SDD
title: #p freq=noraman PBEPBE/SDD
converged: YES YES NO NO
title: Mulliken charges:
elementType: O N N N C C C C C C C C C C C C C C C C C C C C C C C H H H H H H H H H H H H H H H H H H H H H H H
charge: -0.284417 -0.136908 -0.147019 -0.111690 -0.433038 -0.359742 -0.372040 -0.456250 -0.508293 0.208189 0.241381 0.513184 0.481949 -0.307365 -0.460325 -0.427559 -0.328006 -0.385964 -0.188310 -0.229796 -0.226122 -0.241465 -0.240067 -0.348203 -0.244412 -0.244728 -0.212279 0.284361 0.230408 0.249475 0.230771 0.223322 0.231447 0.296769 0.222643 0.221564 0.243667 0.220093 0.231078 0.246371 0.271475 0.231316 0.222573 0.225875 0.222720 0.226713 0.233003 0.225622 0.229246 0.228782
chargesum: 0.00000
title: Mulliken charges with hydrogens summed into heavy atoms:
elementType: O N N N C C C C C C C C C C C C C C C C C C C C C C C
charge: -0.284417 -0.136908 -0.147019 -0.111690 0.081731 0.120504 0.082729 0.063162 -0.286729 0.208189 0.241381 0.513184 0.481949 -0.063698 -0.240232 -0.196480 -0.081635 -0.114489 0.043005 -0.007222 -0.000247 -0.018746 -0.013354 -0.115200 -0.018790 -0.015481 0.016503
polarizability: 3.22129738e+02 -1.13005573e+01 2.57597208e+02 -3.45147087e+01 -4.95807771e+00 2.27061685e+02
1716.lowfreq: -2.6659 -0.0008 -0.0006 0.0001 2.9807 5.6863 15.8843 22.5970 30.2928
frequency: 14.1552 22.5085 30.1961 37.1555 38.1525 55.7047 63.1196 81.4282 91.4170 143.2980 145.3706 173.1516 179.9900 202.0380 216.4203 231.3389 249.5338 280.9198 303.4281 329.7014 334.9295 370.6806 403.5069 406.4185 415.0431 466.3337 474.0906 484.0314 498.3310 506.1779 521.7678 555.3427 595.9227 614.6999 617.1777 619.9095 625.0840 655.1569 694.1841 699.2590 708.5808 728.2725 732.6225 747.4357 755.9201 769.8201 815.1682 835.4917 841.0831 847.9483 859.2800 862.0631 868.5230 911.7825 923.5813 931.6955 943.5897 945.1129 953.1653 965.5679 976.6532 979.9267 983.7308 989.1534 990.6059 991.7333 1001.5272 1015.7934 1028.5545 1028.9985 1042.2061 1052.4383 1078.6474 1079.7927 1088.3506 1089.9315 1098.5793 1162.6101 1169.4464 1170.8271 1172.1499 1177.5979 1189.8341 1193.7978 1199.9630 1202.4229 1210.9638 1220.7956 1238.9907 1250.9551 1267.8717 1279.3473 1306.9168 1328.9031 1332.3333 1337.2037 1338.4944 1348.9335 1354.7756 1367.3731 1378.6033 1382.8416 1384.2832 1389.9018 1425.4152 1440.3733 1443.3835 1471.6004 1477.6429 1480.4329 1482.6491 1483.1417 1492.6764 1500.4032 1552.0930 1579.1485 1592.7281 1595.7250 1599.5198 1608.2925 1613.9548 2941.0820 2963.4830 2971.8526 2978.1855 2997.1563 3018.9543 3029.9923 3081.5943 3084.4829 3107.2698 3114.5894 3122.0235 3123.9019 3124.9034 3135.8188 3136.2628 3138.7353 3145.9726 3156.5525 3162.5172 3166.9055 3174.0778 3177.7858
redmass: 5.5834 5.6253 3.8746 4.1594 4.1145 4.6169 4.8808 4.7581 4.6144 5.8885 4.1311 4.2178 3.2962 3.6411 4.6173 5.2288 4.5203 4.4286 6.7229 2.3432 2.2621 5.1231 2.7726 2.8590 3.5349 4.2762 3.8596 3.8997 3.1890 3.7301 3.0652 6.5018 4.6249 5.9131 6.2802 6.0965 3.4452 2.8224 6.0454 1.6842 1.7789 3.7341 1.8762 2.5456 1.9162 2.3994 2.9995 4.4421 1.3051 1.3778 1.2637 3.1759 1.5605 1.8292 1.9120 2.5129 2.0628 1.4369 5.0735 1.3979 2.1054 1.4348 1.4018 1.8100 3.0057 4.6060 1.3309 2.6220 2.2893 2.1596 2.3097 1.9277 1.7571 1.7413 1.5987 1.7705 1.8274 2.7619 1.0939 1.0727 1.1074 2.1935 1.1209 1.1204 2.0435 1.5936 1.6942 1.5157 1.5879 1.5792 1.6250 1.4553 1.8765 1.6859 1.3150 1.8289 1.3500 1.5799 1.3651 1.6848 4.7053 3.6325 2.3779 4.1427 2.2347 2.2021 2.1070 1.7236 1.2569 1.7013 1.3701 2.1613 1.2622 1.1193 5.5527 7.6319 5.9608 6.0181 6.0436 6.0098 6.1788 1.0584 1.0655 1.0660 1.0809 1.0887 1.0836 1.1029 1.0933 1.0949 1.0877 1.0872 1.0893 1.0863 1.0865 1.0914 1.0889 1.0927 1.0960 1.0981 1.1015 1.0929 1.0965 1.1002
irintensity: 0.0731 0.4343 0.5678 1.2111 0.2400 0.3163 1.8831 0.4962 6.9309 3.1823 0.3310 1.9535 4.1612 0.5923 3.4151 4.0316 0.3841 0.3415 1.6094 4.5584 3.4724 12.6129 0.2024 0.0724 3.0593 11.9214 9.7426 5.7749 2.8011 4.2441 2.4543 12.0761 15.0541 1.0976 2.5623 16.7006 12.5803 2.6401 6.4964 47.2895 65.0781 3.8410 32.1387 33.3196 33.3405 62.9464 2.9989 0.5457 0.2018 0.3929 0.0922 3.7468 3.2945 0.3334 3.1108 9.3551 1.2954 0.8754 43.4428 0.2790 33.1288 6.2648 1.1054 0.2712 1.6455 1.8865 0.2783 19.8479 10.0896 12.5202 3.6749 18.4620 0.2344 1.0915 18.4513 11.6702 26.6535 74.7023 9.5310 0.1018 0.4666 7.5284 1.7045 1.5979 11.5465 46.0006 29.6036 13.0603 19.1263 6.1231 78.3914 27.2034 53.8063 19.1861 1.8948 11.6014 1.3556 44.6342 60.2270 4.7620 71.7397 29.3892 51.4248 36.7713 52.9434 11.6150 14.9287 321.3629 11.5805 27.0164 41.7339 11.2011 9.2574 22.9085 42.6923 256.3490 28.0794 1.4014 330.9070 13.2829 4.8741 52.6557 22.6986 23.4777 16.8777 80.1798 24.3575 29.5670 18.2107 3.9815 11.9007 7.8271 27.8948 0.3510 0.9426 11.2184 12.9462 33.2220 24.8447 43.7373 29.7852 28.8903 5.7469 13.1980
temp: 298.150 k
press: 1.00000 atm
elementType: 8 7 7 7 6 6 6 6 6 6 6 6 6 6 6 6 6 6 6 6 6 6 6 6 6 6 6 1 1 1 1 1 1 1 1 1 1 1 1 1 1 1 1 1 1 1 1 1 1 1
symmnumber: 1
zpe: 1071625.6 jmol-1
zpe.correction: 0.408161 hartree
zpe.thermalcorrener: 0.431077 hartree
zpe.thermalcorrenthalpy: 0.432021 hartree
zpe.thermalcorrgfe: 0.352433 hartree
zpe.sumelectzpe: -1127.811665 hartree
zpe.sumelectthermal: -1127.788748 hartree
zpe.sumelectthermalent: -1127.787804 hartree
zpe.sumelectthermalfe: -1127.867393 hartree
dipole: 1.8559 0.7113 -0.8211
dipole: 2.1505
quadrupole: -153.4401 -151.6840 -153.1935
quadrupole: -11.1615 5.0373 2.7734
quadrupole: -0.6676 1.0886 -0.4210 -11.1615 5.0373 2.7734
hfenergy: -1128.2198255 hartree
pointgroup: C01 [X(C23H23N3O1)]
dipole: -0.7462305 0.2501615 0.3104697 debye
polarizability: 318.8679583|12.8848342|259.9500682|-37.4931144|-1.2418579|227.9706043 unknown
InChI: InChI=1S/C23H23N3O/c27-23(26-17-15-25(16-18-26)21-13-7-8-14-24-21)22(19-9-3-1-4-10-19)20-11-5-2-6-12-20/h1-14,22H,15-18H2
charge 0 multiplicity 1
50 atoms
O  1.405263 -0.889696 -2.015815
N  -0.414228 -0.018524 -0.862613
N  -3.250716 -0.06059 -0.490633
N  -4.939911 0.456034 1.074271
C  -1.309921 -0.322507 -2.001971
C  -1.024417 0.680981 0.303108
C  -2.636954 -0.929871 -1.516261
C  -2.467182 1.101438 -0.033544
C  1.824762 -0.002724 0.252456
C  0.930462 -0.35526 -0.963346
C  -4.470792 -0.388603 0.094433
C  2.923206 -1.053133 0.463488
C  2.382502 1.425957 0.096967
C  -5.206452 -1.552776 -0.305724
C  2.86759 -1.895941 1.601278
C  2.588516 2.218239 1.255502
C  3.994915 -1.207827 -0.450772
C  2.730903 1.962954 -1.168959
C  -6.436038 -1.820339 0.320813
C  3.861856 -2.875394 1.827689
C  3.135345 3.516516 1.156044
C  4.987922 -2.185713 -0.227699
C  3.276609 3.262552 -1.269445
C  -6.131768 0.167691 1.662661
C  4.927381 -3.022474 0.911537
C  3.482569 4.043888 -0.109485
C  -6.925202 -0.950821 1.327736
H  -0.776956 -1.031356 -2.656271
H  -1.500965 0.594417 -2.593983
H  -0.433891 1.580448 0.562229
H  -1.044415 0.009974 1.184959
H  -3.313501 -1.045294 -2.388855
H  -2.451291 -1.943576 -1.102227
H  -2.971651 1.503331 0.85949
H  -2.460928 1.899343 -0.803379
H  1.202575 -0.013502 1.165724
H  -4.826931 -2.225296 -1.07895
H  2.040333 -1.787792 2.315096
H  2.332039 1.810028 2.241389
H  4.045909 -0.573245 -1.339715
H  2.569793 1.36348 -2.072391
H  -7.011092 -2.705354 0.026116
H  3.804316 -3.5183 2.713423
H  3.290748 4.11424 2.061376
H  5.809755 -2.297263 -0.944127
H  3.541514 3.664455 -2.254069
H  -6.455484 0.873623 2.437172
H  5.701338 -3.779351 1.082645
H  3.906435 5.051161 -0.189558
H  -7.878371 -1.131729 1.831787
