program: Gaussian 09
title: 000244356
version: EM64L-G09RevD.01
frameworkgroup: C1[X(C20H32N2O3)]
method: RPBEPBE
basis: SDD
operation: Freq
keyword: #p
keyword: freq=noraman
keyword: PBEPBE/SDD
title: #p freq=noraman PBEPBE/SDD
converged: YES YES NO NO
title: Mulliken charges:
elementType: O O O N N C C C C C C C C C C C C C C C C C C C C H H H H H H H H H H H H H H H H H H H H H H H H H H H H H H H H
charge: -0.248451 -0.246310 -0.403114 -0.083186 -0.094257 0.215283 0.424321 -0.516494 -0.577964 0.132051 0.473273 -0.171805 -0.314272 -0.334551 -0.699747 -0.327734 -0.338714 -0.225499 -0.331755 -0.323943 -0.327712 -0.320217 -0.850504 -0.683553 -0.688178 0.235456 0.190705 0.210906 0.209823 0.178383 0.221807 0.212171 0.182069 0.241015 0.183953 0.234703 0.208175 0.191272 0.157432 0.209770 0.191605 0.192799 0.209710 0.192924 0.213807 0.213601 0.190649 0.225570 0.225048 0.276994 0.219710 0.214744 0.227482 0.231544 0.214184 0.217335 0.337686
chargesum: 0.00000
title: Mulliken charges with hydrogens summed into heavy atoms:
elementType: O O O N N C C C C C C C C C C C C C C C C C C C C
charge: -0.248451 -0.246310 -0.065428 -0.083186 -0.094257 0.215283 0.424321 -0.090333 -0.157235 0.132051 0.473273 -0.171805 0.085918 0.059688 -0.458732 0.090922 0.060733 -0.068068 0.069620 0.078566 0.079020 0.084033 -0.122893 -0.021617 -0.025116
polarizability: 2.76667488e+02 -4.79307435e+00 2.56956090e+02 1.98077688e+01 -4.38306896e+00 1.93911303e+02
1716.lowfreq: -14.9619 -0.6120 -0.0006 -0.0002 0.0004 3.9346 20.4863 21.3331 27.4972
frequency: 17.6879 21.2822 27.3445 31.5086 38.4969 43.0725 60.1857 85.6732 105.1205 128.2906 133.2674 143.9494 158.9579 172.8597 213.1793 226.2738 236.0500 248.0690 254.1199 261.4066 267.6929 281.6954 290.4614 299.4032 317.3446 336.8859 343.3974 371.9854 392.2537 397.2721 406.0085 410.4340 427.1554 445.4688 455.4775 469.4792 471.6653 499.9597 530.8701 546.6193 589.0575 591.0179 611.6223 646.6797 689.7890 695.3148 747.9020 769.2763 794.8183 803.4283 809.7707 812.3802 843.5550 844.2434 869.3928 891.5528 903.2370 908.5473 913.2231 938.7802 952.8027 970.0276 981.9125 994.1986 995.4402 1027.0552 1028.8197 1035.1129 1045.3901 1052.4248 1053.7334 1071.1670 1081.4226 1085.6589 1089.6187 1099.8000 1102.6317 1113.7155 1116.1658 1119.7103 1143.0623 1145.6013 1161.0130 1187.7944 1190.7704 1193.8219 1212.9025 1223.1536 1228.0930 1244.7734 1262.6923 1263.0557 1274.5192 1276.1760 1278.1107 1288.3452 1290.5921 1308.5530 1325.1269 1326.1333 1331.4177 1339.0891 1339.6042 1355.8185 1360.5278 1369.0342 1370.9234 1378.1201 1381.0780 1386.4338 1393.1747 1397.0886 1399.1983 1428.5270 1441.6650 1443.7341 1446.3302 1448.3282 1449.7147 1451.5953 1455.1118 1458.6188 1462.1963 1464.7115 1466.2656 1467.6470 1473.2947 1475.2251 1478.1808 1487.9738 1499.6929 1581.4268 1621.7701 2840.1629 2847.7386 2850.4904 2851.5258 2866.8722 2886.4601 2910.2969 2951.4596 2953.6550 2957.0792 2957.2154 2965.8520 2976.4980 2980.2050 2998.2349 3015.9160 3025.7428 3040.4560 3041.4329 3045.9887 3048.1476 3070.6616 3076.0845 3076.2700 3079.4889 3079.5938 3079.8436 3082.8537 3085.6214 3103.8874 3107.5013 3554.0968
redmass: 3.4305 2.8641 4.2041 3.8406 3.0784 3.9351 5.4440 3.6352 1.8532 3.0037 1.7644 4.5083 3.6371 2.9923 1.0658 2.4591 1.8177 1.2232 2.3482 2.7535 2.9633 3.2879 3.0560 2.7246 2.3214 1.7068 1.8517 3.2131 1.9134 1.8679 3.6738 2.4702 2.8768 5.8723 4.7944 2.8337 2.9975 3.4172 4.9751 3.4731 2.5313 2.1996 2.1910 3.9786 4.1773 4.7175 3.9708 3.7882 4.1542 3.7044 3.8902 3.5842 1.5949 1.5952 2.8227 2.4188 2.2417 1.3982 1.2470 2.4264 1.4502 1.7724 1.8283 2.6664 2.7451 2.1509 2.1252 2.3564 1.5745 2.0282 1.9535 2.0345 2.9306 2.9958 2.5422 2.2731 2.2925 2.5354 2.4269 2.6132 2.0242 2.7408 2.3157 1.0634 1.0741 1.9767 1.4905 2.0207 1.2958 1.4202 1.3212 1.2910 1.4661 1.4385 1.3798 1.2290 1.2319 3.6112 1.3404 1.3363 1.7180 1.2350 1.2508 1.4278 1.4103 1.2700 1.2717 1.1961 1.5988 1.4779 2.0703 1.2525 1.3431 3.3541 1.0832 1.0836 1.0938 1.0963 1.0981 1.0990 1.6785 1.1205 1.2380 1.0486 1.2857 1.0740 1.0855 1.1274 1.0538 1.0968 1.1216 6.3174 6.7577 1.0707 1.0718 1.0697 1.0703 1.0687 1.0700 1.0813 1.0668 1.0660 1.0666 1.0662 1.0438 1.0349 1.0353 1.0876 1.0896 1.0886 1.0882 1.0870 1.0890 1.0916 1.1001 1.0966 1.0995 1.0961 1.0980 1.1003 1.0978 1.1000 1.0960 1.0902 1.0650
irintensity: 0.0303 0.0130 0.3891 0.1907 0.0978 0.0739 0.0881 0.3712 1.7696 0.2510 1.4533 2.9359 2.5597 0.3317 0.0348 4.8469 1.9070 0.5243 6.4085 3.9280 1.8357 5.7056 3.3584 8.0334 25.8446 34.6430 33.5035 12.4566 0.3615 0.6021 0.7385 3.1376 1.2747 8.2964 1.7338 3.4685 0.9822 0.3527 6.6950 2.1728 2.0266 8.2900 3.0046 4.2852 5.9912 2.9671 9.2384 6.7366 5.4247 13.7257 16.6785 32.1291 0.1376 0.0287 2.6649 21.5668 6.3905 20.0689 1.1454 43.3679 0.3107 2.7520 11.7015 71.3216 4.4197 13.4515 14.9254 30.8171 10.9796 26.9944 27.3590 7.8815 49.9519 56.0511 11.6942 12.8178 19.9549 21.0319 2.5181 82.8085 21.6583 7.7240 24.2080 1.9876 0.7952 82.2279 0.8914 1.0755 34.0642 11.1451 18.7753 6.9161 1.6084 36.3193 0.4881 1.6728 2.3336 2.9757 24.5552 12.8868 17.6748 23.7590 5.6502 1.2493 1.5014 2.7576 2.0953 15.2690 5.7596 7.1891 11.9729 4.7885 15.1745 3.7090 1.6725 2.9913 1.3572 5.5470 21.3594 16.3163 41.7685 4.3025 5.5990 2.6277 1.2127 1.4409 3.5206 16.7823 18.9758 27.4827 19.2414 27.4922 5.2660 55.3601 35.0698 97.8460 43.0958 180.4948 126.1674 53.9149 38.7654 29.6450 44.8600 139.8406 34.0729 28.6708 34.9902 18.6780 51.8085 38.2675 24.2643 9.7246 13.8741 24.8937 0.8025 33.9464 104.4205 34.7616 46.8962 27.2566 35.4107 31.8388 16.0625 18.7132 28.6775
temp: 298.150 k
press: 1.00000 atm
elementType: 8 8 8 7 7 6 6 6 6 6 6 6 6 6 6 6 6 6 6 6 6 6 6 6 6 1 1 1 1 1 1 1 1 1 1 1 1 1 1 1 1 1 1 1 1 1 1 1 1 1 1 1 1 1 1 1 1
symmnumber: 1
zpe: 1290733.9 jmol-1
zpe.correction: 0.491615 hartree
zpe.thermalcorrener: 0.517583 hartree
zpe.thermalcorrenthalpy: 0.518527 hartree
zpe.thermalcorrgfe: 0.433473 hartree
zpe.sumelectzpe: -1114.482479 hartree
zpe.sumelectthermal: -1114.456511 hartree
zpe.sumelectthermalent: -1114.455566 hartree
zpe.sumelectthermalfe: -1114.540620 hartree
dipole: 0.9363 2.6837 0.5126
dipole: 2.8881
quadrupole: -183.8648 -139.4545 -148.2324
quadrupole: -7.7052 12.6699 -2.3305
quadrupole: -26.6809 17.7294 8.9515 -7.7052 12.6699 -2.3305
hfenergy: -1114.9740934 hartree
pointgroup: C01 [X(C20H32N2O3)]
dipole: 0.3500845 -1.0747576 -0.116077 debye
polarizability: 276.2830861|2.6690347|255.6804525|-21.2243978|-9.3221403|195.571342 unknown
InChI: InChI=1S/C20H32N2O3/c1-15(2)18-12-17(13-21-4-8-24-9-5-21)16(3)19(20(18)23)14-22-6-10-25-11-7-22/h12,15,23H,4-11,13-14H2,1-3H3
charge 0 multiplicity 1
57 atoms
O  -5.647992 2.056003 -0.846598
O  5.931258 1.475295 0.608301
O  -2.116095 -1.907372 1.453294
N  -3.334246 0.870928 0.446495
N  3.297484 1.009451 -0.532399
C  -0.977808 0.025574 0.600132
C  1.100325 -0.210671 -0.700015
C  -2.09493 0.8121 1.272266
C  2.295592 0.375557 -1.440051
C  0.111919 0.627328 -0.090273
C  -0.091757 -2.245378 0.067385
C  -1.046546 -1.397933 0.687445
C  -3.19225 1.678489 -0.788215
C  -4.505195 1.32233 1.235975
C  0.967617 -1.611215 -0.622542
C  3.914001 0.03824 0.407352
C  4.352467 1.728616 -1.293241
C  -0.156059 -3.775779 0.142333
C  -4.482281 1.591339 -1.61834
C  -5.778134 1.245462 0.377252
C  4.876701 0.767581 1.356064
C  5.313464 2.434557 -0.321535
C  0.265556 2.135768 -0.221033
C  1.028552 -4.351822 0.964791
C  -0.225326 -4.419232 -1.267919
H  -2.369351 0.293965 2.208043
H  -1.746965 1.835728 1.550903
H  2.771821 -0.431024 -2.053567
H  1.967836 1.162877 -2.147189
H  -2.979016 2.754841 -0.556499
H  -2.348588 1.281774 -1.381753
H  -4.617064 0.661671 2.11672
H  -4.378505 2.373445 1.605029
H  1.730798 -2.232355 -1.109281
H  4.477044 -0.75739 -0.145771
H  3.116518 -0.453776 0.992318
H  3.873263 2.480059 -1.950549
H  4.939325 1.028232 -1.940951
H  -1.086592 -4.091591 0.666906
H  -4.434217 2.249142 -2.502354
H  -4.643647 0.539697 -1.940077
H  -5.974076 0.186236 0.103368
H  -6.648134 1.659641 0.913763
H  4.307474 1.493605 1.976015
H  5.407727 0.056164 2.009896
H  6.151814 2.904422 -0.862204
H  4.758649 3.208355 0.252576
H  -0.00623 2.473828 -1.241549
H  -0.368548 2.694778 0.483259
H  1.319179 2.416723 -0.048747
H  1.991795 -4.111436 0.478562
H  0.95408 -5.452336 1.04494
H  1.051835 -3.927467 1.984601
H  -1.088874 -4.035261 -1.839355
H  -0.316271 -5.518598 -1.19039
H  0.688625 -4.19801 -1.848704
H  -2.105226 -2.896956 1.441412
