program: Gaussian 09
title: 000244355
version: EM64L-G09RevD.01
frameworkgroup: C1[X(C15H13NO5)]
method: RPBEPBE
basis: SDD
operation: Freq
keyword: #p
keyword: freq=noraman
keyword: PBEPBE/SDD
title: #p freq=noraman PBEPBE/SDD
converged: YES YES NO NO
title: Mulliken charges:
elementType: O O O O O N C C C C C C C C C C C C C C C H H H H H H H H H H H H H
charge: -0.238354 -0.187850 -0.185384 -0.439937 -0.249028 -0.303201 -0.252887 -0.250051 -0.153350 -0.148057 -0.439486 -0.441665 0.118571 0.112045 0.509649 -0.337893 -0.322551 -0.360092 -0.332696 0.265324 0.110742 0.279238 0.275968 0.279483 0.282351 0.249012 0.211402 0.211548 0.249693 0.274877 0.276618 0.273697 0.276799 0.385465
chargesum: 0.00000
title: Mulliken charges with hydrogens summed into heavy atoms:
elementType: O O O O O N C C C C C C C C C C C C C C C
charge: -0.238354 -0.187850 -0.185384 -0.054472 -0.249028 -0.303201 0.026351 0.025917 0.126133 0.134294 0.020928 0.019576 0.118571 0.112045 0.509649 -0.063016 -0.045933 -0.086395 -0.055897 0.265324 0.110742
polarizability: 2.76668593e+02 1.48732091e+00 1.69301913e+02 8.30656156e+00 -6.38647212e+00 1.05471740e+02
1716.lowfreq: -4.6391 0.0003 0.0006 0.0007 5.3089 6.9604 32.3527 36.9709 55.9652
frequency: 32.2567 36.9519 55.9629 67.2901 79.8697 112.1931 145.2923 163.9982 190.5202 212.8927 223.5353 251.8665 314.1456 318.8655 381.7009 398.8094 407.1988 471.7939 488.9698 499.0465 505.7608 553.9634 580.0902 590.6950 593.6415 624.4083 629.2144 642.2570 685.2164 703.4994 754.8135 770.1542 772.6736 785.3532 790.8710 798.7497 842.9823 858.0901 863.7650 879.2801 896.6160 904.7245 925.8818 961.8359 970.0788 982.1931 984.4069 989.4798 1002.4576 1025.6824 1031.9330 1034.7277 1041.9571 1113.1176 1128.0033 1150.7532 1154.3058 1166.1679 1179.8096 1185.3023 1199.6493 1202.8409 1204.8332 1232.3205 1236.8264 1241.2889 1277.5211 1284.3979 1291.9546 1310.3288 1312.4569 1323.0358 1330.5716 1386.0325 1419.1574 1462.4911 1478.3514 1503.9726 1577.9536 1619.4251 1631.3376 1643.4588 1693.6342 3022.3606 3035.1681 3063.9438 3076.7154 3083.3498 3104.6824 3126.9704 3133.9823 3161.2752 3175.0613 3195.1329 3199.9836 3533.2725
redmass: 6.7324 5.9084 6.2342 5.3058 5.6278 7.4635 9.1319 6.1787 4.9318 6.0221 5.8325 2.2633 5.6851 5.3506 7.2022 5.9661 3.0912 5.7736 5.2175 4.2022 5.1300 5.7122 3.2412 2.3976 2.3616 5.5494 5.7041 6.7625 3.4085 5.5829 4.4709 6.0354 5.1736 6.1133 1.7760 5.7136 1.2538 1.8228 1.9854 2.6587 5.0261 3.5706 3.4749 3.6772 3.0305 1.3774 1.6852 1.3863 4.5955 2.7611 2.2246 1.8220 3.0811 1.2369 1.4321 1.7557 3.6927 2.0650 2.8966 1.3090 1.2844 1.2859 1.3425 1.5786 1.2312 1.3962 1.4856 1.6618 1.5782 1.4966 1.3749 2.4840 5.6533 7.7778 3.4148 1.0823 1.0945 2.6298 7.7800 6.2461 12.1401 8.7644 12.5279 1.0595 1.0629 1.0853 1.0873 1.1047 1.1047 1.0891 1.0950 1.0907 1.0900 1.0951 1.0964 1.0642
irintensity: 2.1025 1.0321 1.5840 0.0776 1.0238 1.3732 5.1502 0.1086 0.8640 1.0906 0.6575 0.6623 2.9940 4.1700 3.6627 35.8513 9.4705 9.7678 4.1525 24.6999 10.5641 19.1024 39.2631 31.8519 25.2696 28.2902 6.1135 2.9050 77.2120 7.6933 25.8294 2.7264 5.9896 9.8927 7.2365 26.6147 0.5147 4.1156 60.1269 1.9005 0.6337 4.1881 7.3649 10.5399 13.3229 6.1494 29.2098 0.8598 188.6969 104.0666 5.6930 14.0435 41.6115 4.7226 5.7041 151.6860 172.2334 23.9866 165.3357 5.0251 5.0506 12.1457 3.1817 3.0538 1.0226 6.7003 3.7120 1.0448 22.0792 33.0322 15.5600 38.1892 460.5558 5.3173 26.1319 4.8087 12.6946 65.5944 30.2798 81.4080 385.2422 362.9195 11.7999 24.7477 39.4963 5.3470 6.5225 0.0677 36.9322 16.0154 4.6864 0.4927 0.3484 0.6450 0.6643 52.2728
temp: 298.150 k
press: 1.00000 atm
elementType: 8 8 8 8 8 7 6 6 6 6 6 6 6 6 6 6 6 6 6 6 6 1 1 1 1 1 1 1 1 1 1 1 1 1
symmnumber: 1
zpe: 673998.9 jmol-1
zpe.correction: 0.256713 hartree
zpe.thermalcorrener: 0.273433 hartree
zpe.thermalcorrenthalpy: 0.274378 hartree
zpe.thermalcorrgfe: 0.210953 hartree
zpe.sumelectzpe: -1008.798212 hartree
zpe.sumelectthermal: -1008.781491 hartree
zpe.sumelectthermalent: -1008.780547 hartree
zpe.sumelectthermalfe: -1008.843972 hartree
dipole: -5.1523 -0.7547 -1.1818
dipole: 5.3397
quadrupole: -99.7937 -128.2831 -122.3180
quadrupole: -11.4554 9.4879 -5.8784
quadrupole: 17.0045 -11.4848 -5.5197 -11.4554 9.4879 -5.8784
hfenergy: -1009.0549249 hartree
pointgroup: C01 [X(C15H13N1O5)]
dipole: -2.02648 -0.3186924 -0.4529692 debye
polarizability: 276.6315906|1.7791827|168.3880767|8.6345689|-9.9031095|106.4225787 unknown
InChI: InChI=1S/C15H13NO5/c17-13-11-9-5-6-10(21-9)12(11)14(18)16(13)8-3-1-7(2-4-8)15(19)20/h1-4,9-12,19H,5-6H2
charge 0 multiplicity 1
34 atoms
O  -3.185401 -0.357222 1.452595
O  -0.850404 -2.200418 -0.985174
O  -0.847169 2.405191 0.031582
O  5.700272 -1.194138 0.856642
O  5.993291 0.917265 -0.064593
N  -0.48504 0.095215 -0.445794
C  -2.746348 -0.608327 -0.861311
C  -2.746261 0.907436 -0.508045
C  -3.600292 -1.215974 0.301339
C  -3.581901 0.936156 0.817266
C  -5.089715 -0.824081 0.097014
C  -5.07842 0.703882 0.473738
C  -1.284553 -1.044085 -0.786088
C  -1.283001 1.273408 -0.275084
C  0.942894 0.055868 -0.263258
C  1.736594 1.158288 -0.672684
C  1.547361 -1.083246 0.3270
C  3.129217 1.116373 -0.488137
C  2.942406 -1.118569 0.502649
C  3.742591 -0.020184 0.097808
C  5.218721 -0.013434 0.266456
H  -3.153847 -0.864603 -1.852377
H  -3.172776 1.572064 -1.276331
H  -3.387109 -2.266724 0.535916
H  -3.346214 1.763298 1.498877
H  -5.731011 -1.398796 0.784422
H  -5.434585 -1.011709 -0.934589
H  -5.427196 1.353858 -0.347262
H  -5.704424 0.899474 1.359112
H  1.267338 2.038691 -1.11528
H  0.933627 -1.931311 0.635263
H  3.760268 1.956171 -0.795492
H  3.420095 -1.990487 0.956821
H  6.688794 -1.126231 0.941998
