program: Gaussian 09
title: 000244354
version: EM64L-G09RevD.01
frameworkgroup: C1[X(C9H11NO3)]
method: RPBEPBE
basis: SDD
operation: Freq
keyword: #p
keyword: freq=noraman
keyword: PBEPBE/SDD
title: #p freq=noraman PBEPBE/SDD
converged: NO YES NO NO
title: Mulliken charges:
elementType: O O O N C C C C C C C C C H H H H H H H H H H H
charge: -0.262621 -0.207361 -0.201863 -0.349796 0.346706 -0.290185 -0.228362 -0.160803 -0.504220 -0.436675 -0.774132 0.142566 0.132069 0.272323 0.268554 0.279196 0.217194 0.245967 0.246161 0.209226 0.228592 0.253763 0.223458 0.350242
chargesum: 0.00000
title: Mulliken charges with hydrogens summed into heavy atoms:
elementType: O O O N C C C C C C C C C
charge: -0.262621 -0.207361 -0.201863 0.000447 0.346706 -0.017861 0.040192 0.118393 -0.041059 0.018712 -0.068319 0.142566 0.132069
polarizability: 1.09976393e+02 -4.49115463e+00 1.20176366e+02 5.31331926e+00 -1.61329006e+00 7.62593369e+01
1716.lowfreq: -14.0997 -10.4340 -5.9665 -0.0009 -0.0002 0.0003 55.0480 144.4732 157.3729
frequency: 54.9999 144.4638 157.3677 167.9880 182.6501 226.0964 299.3830 313.0582 332.9673 414.7957 460.6519 528.1799 546.8165 587.6975 602.5319 636.5571 668.1021 712.7943 748.9021 771.0109 795.5078 811.6357 847.8975 860.5897 879.7504 908.4989 927.6646 947.9759 961.7942 980.2183 1009.2641 1021.0934 1076.2064 1114.8894 1160.6844 1173.2144 1181.8449 1185.8572 1217.3461 1221.1656 1230.3289 1253.0503 1263.7824 1276.4486 1288.8885 1298.0158 1311.8561 1329.1946 1403.2791 1457.9654 1465.0792 1472.2130 1481.0647 1661.6881 1699.4044 3001.5026 3016.8706 3031.0340 3058.9915 3072.4119 3076.3660 3093.7536 3099.5245 3111.1958 3125.5885 3550.3813
redmass: 5.0355 3.3881 1.7609 4.5785 2.3249 2.0540 4.3665 3.1173 3.0296 4.5744 4.7431 5.0654 3.9148 5.6376 7.9566 3.6612 5.5493 4.1732 1.3541 4.1295 2.3541 4.5423 1.9653 3.3135 2.7443 3.3552 2.5707 2.9599 2.1005 2.1638 1.9744 1.7692 1.6858 1.4288 1.9131 1.6512 3.0867 1.4499 1.5362 1.3918 1.5014 1.8670 1.8861 1.5608 2.7908 1.7969 2.0599 1.7704 1.2604 1.0611 1.0714 1.0530 1.0948 7.5147 12.4813 1.0370 1.0589 1.0626 1.0854 1.0874 1.1044 1.0996 1.1041 1.0993 1.0918 1.0791
irintensity: 0.0267 6.1701 4.4795 2.0152 0.7356 1.5338 4.5576 5.9701 1.5123 22.4139 2.9389 3.1329 11.4161 2.2836 7.2792 8.3719 0.5707 3.4824 109.2485 33.3724 2.8306 9.8809 12.3899 5.1144 1.4563 1.2342 6.4497 12.6177 19.4448 19.4480 5.3361 5.6881 11.3385 3.3179 8.3754 62.5582 146.2382 8.7277 22.1830 13.6130 34.5865 42.3037 6.0638 15.4201 73.4395 11.6657 7.0196 14.8848 27.3939 3.6460 4.5664 14.4945 11.3992 621.7547 69.7234 12.1299 29.2811 34.6348 6.7665 4.8759 0.4576 6.2888 49.6796 15.2045 11.8370 51.7721
temp: 298.150 k
press: 1.00000 atm
elementType: 8 8 8 7 6 6 6 6 6 6 6 6 6 1 1 1 1 1 1 1 1 1 1 1
symmnumber: 1
zpe: 502252.1 jmol-1
zpe.correction: 0.191298 hartree
zpe.thermalcorrener: 0.201920 hartree
zpe.thermalcorrenthalpy: 0.202865 hartree
zpe.thermalcorrgfe: 0.155175 hartree
zpe.sumelectzpe: -629.033721 hartree
zpe.sumelectthermal: -629.023099 hartree
zpe.sumelectthermalent: -629.022154 hartree
zpe.sumelectthermalfe: -629.069844 hartree
dipole: -2.8310 -0.7323 -2.3598
dipole: 3.7576
quadrupole: -74.3191 -86.5264 -75.6711
quadrupole: 4.4125 1.8201 3.8595
quadrupole: 4.5198 -7.6876 3.1678 4.4125 1.8201 3.8595
hfenergy: -629.2250189 hartree
pointgroup: C01 [X(C9H11N1O3)]
dipole: -1.1030723 -0.2602303 -0.949218 debye
dipolederiv: -0.572507 0.0192567 0.0027453 0.025259 -0.6324721 -0.0264004 0.0520393 0.0248961 -0.5230008 -0.5306214 -0.1243161 -0.0212947 -0.0322868 -1.1815708 0.0804307 -0.0650845 -0.0116354 -0.3500898 -0.7535129 0.3622373 -0.107545 0.2977498 -0.9471795 0.0841876 -0.1865467 0.1613454 -0.3873366 -0.6245668 0.2489802 -0.0706848 0.2624012 -1.4594234 0.1384413 -0.1725512 0.1157454 -0.3220337 0.6116217 -0.0187991 -0.0309972 -0.0685214 0.4700405 0.0151775 -0.1692228 -0.1173708 0.3276015 -0.4517583 -0.1303667 0.0287149 -0.0711066 -0.1370422 -0.073506 -0.0100924 -0.0224053 0.0377632 -0.4352565 -0.0347723 -0.0494812 -0.1419488 -0.050144 0.0835077 -0.0575112 0.0112576 0.0089426 0.5077312 0.0684856 -0.011926 0.0917668 0.3803821 -0.0066816 -0.1823105 0.0819939 0.2964193 -0.038981 -0.0727588 -0.0774634 -0.058184 -0.0934605 -0.0766322 -0.014112 -0.0047149 0.0689679 -0.0915412 0.0123025 -0.1162053 0.0366577 0.016612 0.020973 -0.0254685 -0.0159923 0.0723997 -0.0208819 0.0189339 0.0016107 0.0215022 -0.103997 -0.0433229 0.0341809 -0.1045002 0.0124297 1.0246379 -0.3329418 0.2275564 -0.0872724 1.6254989 -0.1631685 0.416898 -0.1841943 0.2794033 0.9582487 -0.0652309 0.2102458 -0.299572 1.7099444 -0.1181351 0.3960048 -0.0300517 0.2891709 0.0723204 0.0111162 -0.0465007 -0.0105494 0.043587 0.0434705 -0.0380585 0.0540875 -0.0452462 0.0685331 0.0136378 -0.0010311 0.0286771 0.0256643 -0.0719281 0.0098997 -0.0838712 -0.0223266 0.0388825 0.0539215 -0.0280457 0.0190389 -0.0253362 0.0448472 -0.0164266 0.0716101 0.0304664 0.0806424 0.0061984 0.0104975 0.0172829 0.0372628 0.0629463 -0.0474643 0.0731741 -0.1246693 -0.1235063 0.0491497 0.0511217 0.0416817 0.0453331 -0.0050548 0.0951919 -0.0233572 0.0437113 -0.0606803 -0.094503 0.0589338 -0.0635104 -0.0043331 0.0353292 0.0759647 0.0817705 0.0290604 0.080307 0.0251643 0.0363407 0.0062442 -0.003732 -0.0813676 0.0001673 -0.1328752 -0.0888751 -0.0672632 0.0163721 0.1160431 -0.0309522 0.082454 0.0288563 0.1194614 -0.0180758 0.025791 0.0019501 -0.0736142 -0.0974943 -0.0350339 0.0468835 -0.0362377 -0.0841209 -0.0414302 0.0549176 0.0954937 0.0306038 -0.0282485 0.0400782 0.0098849 0.0586522 -0.0509503 0.1077421 -0.0317668 0.2307082 0.0109431 -0.0568918 0.0105982 0.1451432 0.0056154 -0.079888 0.0068518 0.3183002 unknown
polarizability: 109.7271596|-4.4648792|120.3126667|5.7033227|-0.9551118|76.3722688 unknown
InChI: InChI=1S/C9H11NO3/c1-9-3-2-4(13-9)5-6(9)8(12)10-7(5)11/h4-6,10H,2-3H2,1H3
charge 0 multiplicity 1
24 atoms
O  -0.948655 -0.346813 1.225147
O  1.300721 2.589081 -0.25436
O  2.478908 -1.908414 0.368811
N  2.131512 0.423268 0.184233
C  -1.315444 0.620606 0.13156
C  -0.031884 0.535112 -0.788746
C  0.38927 -0.963844 -0.629832
C  -0.704741 -1.51857 0.336738
C  -2.458369 -0.147841 -0.610403
C  -2.044341 -1.650842 -0.434067
C  -1.683574 1.968873 0.725102
C  1.165144 1.34395 -0.275666
C  1.774516 -0.931587 0.027973
H  -0.263315 0.84871 -1.81973
H  0.443617 -1.538024 -1.56924
H  -0.391698 -2.377271 0.944852
H  -2.541115 0.154313 -1.668944
H  -3.423241 0.061806 -0.119413
H  -2.778808 -2.194618 0.181994
H  -1.93111 -2.187906 -1.39182
H  -2.544889 1.850174 1.404907
H  -0.845628 2.407217 1.289925
H  -1.959773 2.682847 -0.070417
H  3.016196 0.717676 0.605396
