program: Gaussian 09
title: 000244330
version: EM64L-G09RevD.01
frameworkgroup: C1[X(C10H9ClN6O)]
method: RPBEPBE
basis: SDD
operation: Freq
keyword: #p
keyword: freq=noraman
keyword: PBEPBE/SDD
title: #p freq=noraman PBEPBE/SDD
converged: NO YES NO NO
title: Mulliken charges:
elementType: Cl O N N N N N N C C C C C C C C C C H H H H H H H H H
charge: -0.059177 -0.332214 -0.445539 -0.142756 -0.108946 -0.602693 -0.018731 -0.568651 0.422173 0.254668 -0.160808 -0.426474 -0.308470 0.197541 -0.182931 -0.202049 0.013783 -0.118147 0.348206 0.250997 0.309719 0.256784 0.251218 0.363470 0.333216 0.335065 0.340745
chargesum: 0.00000
title: Mulliken charges with hydrogens summed into heavy atoms:
elementType: Cl O N N N N N N C C C C C C C C C C
charge: -0.059177 -0.332214 -0.097333 -0.142756 -0.108946 0.093994 -0.018731 0.107159 0.422173 0.254668 -0.160808 -0.175477 0.001249 0.197541 0.073853 0.049169 0.013783 -0.118147
polarizability: 3.28395823e+02 -8.91862251e-01 2.07412876e+02 6.94224510e-02 -1.45838432e-01 6.25135468e+01
1716.lowfreq: -4.1713 -0.0015 -0.0012 -0.0010 4.4580 5.0098 38.7033 46.4800 74.7848
frequency: 38.6142 46.3244 74.7842 76.8210 135.5806 190.6411 199.9223 210.8577 218.7284 246.0400 280.4123 313.0158 317.1062 327.9679 406.3747 408.4635 416.8756 423.6051 514.7745 519.4650 519.8190 550.3316 554.8917 566.1449 608.2970 623.3201 655.4632 665.2552 679.9227 709.2145 716.1351 719.7369 786.6267 797.4425 816.5884 821.6424 844.2248 942.0736 949.9050 983.8277 995.3538 1017.0614 1025.2220 1071.8332 1108.1010 1132.2864 1140.6203 1174.0971 1183.7411 1251.7903 1286.6557 1295.2372 1324.4899 1371.6961 1394.1380 1407.0696 1449.1935 1478.6443 1495.0608 1506.0603 1554.0920 1574.1648 1596.0596 1601.5938 1624.5816 1637.7039 2881.3777 3137.8265 3162.6340 3172.6988 3195.4907 3498.0262 3550.0955 3670.4021 3709.3000
redmass: 7.0107 4.0817 8.2101 8.1590 7.9537 11.5608 6.3356 8.2372 7.4142 9.5669 4.7476 3.3447 6.7112 5.0995 10.2784 4.3939 3.7241 5.6963 2.1918 5.0037 1.4135 6.1006 1.1888 1.1364 7.7637 7.0616 6.5680 1.6666 2.2862 3.7298 5.8576 8.5026 8.7882 10.3105 5.1821 1.3599 1.4332 2.3919 1.3444 1.3184 4.3248 1.1275 3.4646 2.6258 1.4785 2.1115 2.7979 7.5337 1.1316 4.8448 2.9218 1.6568 4.6296 6.7353 5.5238 3.5934 4.3076 2.7383 2.9254 2.2675 3.8412 5.3339 1.7054 6.0056 2.2344 1.7619 1.0874 1.0902 1.0913 1.0959 1.0952 1.0460 1.0445 1.1037 1.1059
irintensity: 0.0289 0.7376 0.4668 0.7687 2.0703 1.8940 8.6373 0.8203 2.8831 2.7361 15.4075 7.1011 0.0643 4.7645 15.1748 0.0077 0.0690 10.9232 0.1032 15.2935 256.8910 2.4353 71.6290 151.7813 7.0936 2.7701 6.2396 17.0692 80.6169 0.0555 1.5747 13.6080 30.3723 2.9454 21.0126 11.1830 65.2101 8.9942 0.4590 3.5825 36.9938 100.5301 10.9272 48.8146 15.5697 2.4940 15.0182 142.8223 0.3649 99.6641 28.3928 17.7528 75.4630 137.2302 251.9897 25.0659 84.0431 112.2572 272.4416 140.2379 887.1691 29.7105 604.7358 23.9862 309.0434 241.6769 121.2203 4.7456 2.6184 2.7005 11.1326 119.0715 162.9526 75.1037 50.7771
temp: 298.150 k
press: 1.00000 atm
elementType: 17 8 7 7 7 7 7 7 6 6 6 6 6 6 6 6 6 6 1 1 1 1 1 1 1 1 1
symmnumber: 1
zpe: 505731.1 jmol-1
zpe.correction: 0.192623 hartree
zpe.thermalcorrener: 0.207959 hartree
zpe.thermalcorrenthalpy: 0.208903 hartree
zpe.thermalcorrgfe: 0.149304 hartree
zpe.sumelectzpe: -1248.980540 hartree
zpe.sumelectthermal: -1248.965204 hartree
zpe.sumelectthermalent: -1248.964260 hartree
zpe.sumelectthermalfe: -1249.023858 hartree
dipole: -3.5757 3.9888 0.0130
dipole: 5.3569
quadrupole: -101.3409 -101.3281 -115.3418
quadrupole: -11.3278 -0.0082 -0.0643
quadrupole: 4.6627 4.6755 -9.3382 -11.3278 -0.0082 -0.0643
hfenergy: -1249.1731626 hartree
pointgroup: C01 [X(C10H9Cl1N6O1)]
dipole: 1.451839 -1.4727709 -0.4061105 debye
polarizability: 328.2253808|3.9677747|198.3791618|-4.790783|35.1176093|71.7177027 unknown
InChI: InChI=1S/C10H9ClN6O/c11-5-1-3-6(4-2-5)14-9-7(17-18)8(12)15-10(13)16-9/h1-4,14H,12-13H2
charge 0 multiplicity 1
27 atoms
Cl -6.102025 -0.647727 0.025873
O  1.220308 2.908353 0.782928
N  -0.230738 0.800744 0.273124
N  0.94465 -1.217236 -0.270503
N  3.418164 -1.19459 -0.317761
N  4.600233 0.769615 0.158353
N  2.325616 2.195532 0.574338
N  2.194469 -3.114423 -0.781967
C  -1.58188 0.388444 0.196379
C  0.931921 0.104742 0.068744
C  2.1734 0.862041 0.235952
C  -2.562286 1.380822 0.484633
C  -2.001074 -0.927266 -0.145099
C  3.411532 0.121897 0.018646
C  -3.934716 1.072546 0.434905
C  -3.37635 -1.236345 -0.195408
C  2.182768 -1.788846 -0.441796
C  -4.325759 -0.238086 0.093924
H  -0.014338 1.807666 0.528081
H  -2.247144 2.396888 0.748739
H  -1.245066 -1.681835 -0.363983
H  -4.684228 1.837363 0.65694
H  -3.702611 -2.246917 -0.458344
H  4.580577 1.759037 0.413573
H  5.468616 0.260106 0.008965
H  1.313457 -3.610919 -0.889237
H  3.088503 -3.579803 -0.919697
