program: Gaussian 09
title: 000244321
version: EM64L-G09RevD.01
frameworkgroup: C1[X(C18H21NO6)]
method: RPBEPBE
basis: SDD
operation: Freq
keyword: #p
keyword: freq=noraman
keyword: PBEPBE/SDD
title: #p freq=noraman PBEPBE/SDD
converged: YES YES NO NO
title: Mulliken charges:
elementType: O O O O O O N C C C C C C C C C C C C C C C C C C H H H H H H H H H H H H H H H H H H H H H
charge: -0.263917 -0.239405 -0.110875 -0.202485 -0.215368 -0.247728 -0.157406 -0.215878 -0.362002 -0.354001 0.049401 0.116884 -0.590176 0.254404 0.261227 0.517936 -0.389786 -0.396089 -0.265337 -0.264505 -0.246154 -0.220861 -0.659731 -0.240020 -0.658404 0.301814 0.342988 0.232231 0.264415 0.233892 0.221605 0.248130 0.225761 0.228848 0.240223 0.233839 0.229678 0.229418 0.223873 0.232190 0.251332 0.224757 0.226851 0.217487 0.245363 0.245582
chargesum: 0.00000
title: Mulliken charges with hydrogens summed into heavy atoms:
elementType: O O O O O O N C C C C C C C C C C C C C C C C C C
charge: -0.263917 -0.239405 -0.110875 -0.202485 -0.215368 -0.247728 -0.157406 0.085936 -0.019015 0.142646 0.049401 0.116884 -0.134679 0.254404 0.261227 0.517936 -0.141656 -0.170328 0.203734 0.199012 -0.016736 0.003012 0.048547 -0.013169 0.050028
polarizability: 2.33691315e+02 -7.43150554e+00 2.37646606e+02 -1.63066977e+01 -4.07365376e+00 1.71173971e+02
1716.lowfreq: -5.6668 -4.4734 -0.0007 -0.0006 0.0003 3.6359 16.5884 20.7405 26.1553
frequency: 16.5105 20.5109 26.0890 29.8149 42.4206 48.9447 53.5063 60.7216 68.7257 79.0361 89.5681 93.3816 104.3667 138.5655 149.5450 166.9245 189.7176 218.4958 250.4416 252.0595 281.1828 298.4476 308.4184 321.2934 328.2692 336.1354 350.7823 398.7541 404.8296 434.6463 435.9256 458.2023 493.1106 534.2919 554.6228 581.6001 608.3246 617.9311 631.6176 678.0177 685.4157 706.2426 706.6513 752.7548 754.5941 774.2311 776.3591 794.9138 813.7083 818.5453 837.8799 854.3558 874.1866 902.9515 919.7721 936.7607 946.2618 965.7081 977.7540 989.8500 995.5771 1001.2071 1004.8594 1021.9435 1028.6349 1058.0156 1083.7891 1094.9497 1096.9139 1100.2152 1122.6992 1141.0071 1141.6575 1157.4476 1160.1856 1172.7502 1191.2208 1200.4833 1208.6983 1214.5067 1220.6032 1255.3656 1275.4385 1276.2057 1293.9944 1322.1085 1330.5928 1336.1677 1353.5922 1355.8600 1358.5089 1382.2771 1384.7971 1393.0976 1394.1003 1441.1729 1457.7800 1458.0183 1459.5875 1463.5470 1463.9996 1475.8736 1483.7050 1484.2069 1487.2122 1594.5530 1613.7706 1617.4912 1638.8146 1641.5640 1684.8997 2992.6286 2996.4031 2997.0318 3004.2604 3024.3990 3032.3290 3033.4544 3035.0376 3048.1813 3074.0552 3091.9114 3092.5289 3098.9940 3100.0838 3112.6955 3120.9337 3125.1434 3125.3329 3132.7657 3145.3717 3163.1549
redmass: 4.8737 4.9121 5.3843 4.6649 3.2117 4.7224 4.5018 4.0233 6.7028 6.6463 5.5385 3.3965 4.7335 5.1936 3.8318 4.7230 1.6704 1.2881 6.6211 1.9355 4.3704 2.9886 3.3447 4.2972 5.9173 4.1504 2.7218 4.2580 2.8709 3.6351 3.7725 5.4459 4.1338 5.0282 8.0255 3.1587 4.9577 6.2937 7.2572 4.6401 4.8928 2.4834 2.6978 3.5637 2.1477 2.5442 3.4808 3.8237 1.3755 1.5228 4.7002 1.2512 2.8872 3.3496 1.6480 3.4913 2.4170 2.5582 1.3888 5.2815 1.3936 2.7467 2.7651 3.7189 2.2688 2.8956 2.5432 2.2139 2.2132 1.9818 2.5423 2.3425 2.8798 1.6838 1.7517 1.0584 1.1749 1.3095 1.6509 1.9950 1.6776 1.9485 1.1258 1.1219 1.6552 1.4891 1.4864 1.3487 1.2968 1.3905 1.3139 3.2394 3.2297 1.2285 1.2231 2.1789 1.0925 1.0915 1.0909 1.0507 1.0430 1.1120 1.0537 1.0518 2.2763 5.9740 7.0862 7.2371 9.1572 11.1775 12.9728 1.0603 1.0363 1.0361 1.0611 1.0826 1.0799 1.0614 1.0617 1.1017 1.1022 1.0984 1.0975 1.1031 1.1018 1.0877 1.0867 1.1063 1.1067 1.0909 1.0957 1.1015
irintensity: 0.3258 0.5261 0.7258 1.0720 0.6671 2.0216 1.0767 0.0813 1.1940 1.0500 0.9650 0.4974 0.0655 3.0791 1.0740 1.0347 0.1780 7.6565 1.6740 0.4102 2.5054 20.7337 15.2611 2.9619 2.3951 11.4094 3.8674 4.5866 0.3627 2.5660 7.0847 12.7270 15.0639 3.4052 4.8212 7.5655 4.5125 0.4898 3.4901 3.9170 33.3035 26.2192 31.5075 10.0952 27.2940 24.7481 1.6404 1.8050 3.4594 13.1300 2.0918 0.7914 4.0506 38.1962 5.4627 6.3663 1.0376 1.9894 1.0111 0.5399 4.3369 77.0751 85.0768 33.7954 2.6416 83.2946 29.5122 41.4149 25.5097 4.7560 163.3739 283.2456 29.2013 28.0006 31.9511 0.2506 2.3067 28.9298 143.8094 78.6999 77.3242 28.8119 9.0767 7.0862 56.1907 1.1357 15.4168 12.5165 6.4706 6.4352 2.4286 6.3679 5.3293 26.4254 21.7391 10.8786 15.3930 21.0324 21.4376 11.7712 16.6359 10.1715 14.3368 14.1262 12.9356 1.1508 81.8438 146.0902 107.1158 200.6476 184.6556 12.1886 14.3468 15.8368 50.5890 9.3524 19.7271 31.3111 17.6857 18.3009 13.6573 29.0698 29.0587 1.1600 5.0886 9.2517 1.6588 25.9973 27.3663 11.3947 34.0553 23.2752
temp: 298.150 k
press: 1.00000 atm
elementType: 8 8 8 8 8 8 7 6 6 6 6 6 6 6 6 6 6 6 6 6 6 6 6 6 6 1 1 1 1 1 1 1 1 1 1 1 1 1 1 1 1 1 1 1 1 1
symmnumber: 1
zpe: 951551.6 jmol-1
zpe.correction: 0.362427 hartree
zpe.thermalcorrener: 0.387690 hartree
zpe.thermalcorrenthalpy: 0.388634 hartree
zpe.thermalcorrgfe: 0.302687 hartree
zpe.sumelectzpe: -1202.759536 hartree
zpe.sumelectthermal: -1202.734273 hartree
zpe.sumelectthermalent: -1202.733329 hartree
zpe.sumelectthermalfe: -1202.819276 hartree
dipole: 3.7605 -2.1101 -4.9999
dipole: 6.6025
quadrupole: -136.1249 -117.3825 -166.3130
quadrupole: -6.3940 -2.7958 -8.2615
quadrupole: 3.8152 22.5576 -26.3729 -6.3940 -2.7958 -8.2615
hfenergy: -1203.1219631 hartree
pointgroup: C01 [X(C18H21N1O6)]
dipole: 1.1634458 0.9759339 2.1075156 debye
polarizability: 229.9616846|2.5818242|240.0704238|16.7322854|10.6018433|172.4797841 unknown
InChI: InChI=1S/C18H21NO6/c1-3-24-17(22)13-14(18(23)25-4-2)19(16(21)15(13)20)11-10-12-8-6-5-7-9-12/h5-9,13-14H,3-4,10-11H2,1-2H3
charge 0 multiplicity 1
46 atoms
O  2.083999 2.709064 1.1116
O  2.856891 -2.682628 -0.159092
O  0.824203 -1.858723 -2.519605
O  -1.140017 0.419476 -2.608675
O  3.32961 1.901265 -0.690633
O  1.317067 -1.900636 1.415947
N  0.110399 1.104792 -0.715094
C  1.295979 0.689613 0.077797
C  1.828974 -0.585926 -0.611554
C  -0.762934 2.217969 -0.312649
C  0.822981 -0.876391 -1.760176
C  -0.198962 0.274352 -1.788198
C  -1.48393 1.975941 1.04825
C  2.361016 1.8052 0.09505
C  1.956201 -1.766232 0.343035
C  -2.425887 0.781116 1.02887
C  -1.991937 -0.502755 1.449499
C  -3.75485 0.926102 0.552726
C  3.035913 3.863672 1.268856
C  2.973516 -3.99212 0.567391
C  -2.866047 -1.612825 1.39471
C  -4.629832 -0.180503 0.49655
C  4.234323 3.45507 2.127481
C  -4.187272 -1.456086 0.918319
C  1.884421 -4.957032 0.094655
H  0.998729 0.475202 1.119523
H  2.809329 -0.401937 -1.08958
H  -0.16937 3.148946 -0.248169
H  -1.503721 2.327571 -1.124619
H  -0.726072 1.871163 1.846947
H  -2.046011 2.903982 1.267958
H  -0.971527 -0.647696 1.825782
H  -4.106304 1.912163 0.222485
H  2.419133 4.636902 1.752756
H  3.349036 4.193163 0.262918
H  2.908344 -3.796235 1.652094
H  3.983788 -4.338352 0.299585
H  -2.512742 -2.596384 1.72418
H  -5.652489 -0.050155 0.124883
H  3.90572 3.068784 3.107397
H  4.838756 2.685006 1.620192
H  4.878636 4.336209 2.30276
H  -4.864338 -2.31656 0.874488
H  2.042375 -5.948545 0.557839
H  1.914965 -5.074482 -1.001518
H  0.883037 -4.597112 0.384537
