program: Gaussian 09
title: 000244319
version: EM64L-G09RevD.01
frameworkgroup: C1[X(C17H22N2O8)]
method: RPBEPBE
basis: SDD
operation: Freq
keyword: #p
keyword: freq=noraman
keyword: PBEPBE/SDD
title: #p freq=noraman PBEPBE/SDD
converged: YES YES NO NO
title: Mulliken charges:
elementType: O O O O O O O O N N C C C C C C C C C C C C C C C C C H H H H H H H H H H H H H H H H H H H H H H
charge: -0.246694 -0.246182 -0.117977 -0.117390 -0.236356 -0.236412 -0.262336 -0.262128 -0.129546 -0.129491 -0.431086 -0.378756 -0.377984 -0.426180 -0.425363 -0.330596 -0.331430 0.153238 0.154228 0.081192 0.080702 0.284123 0.283470 -0.234159 -0.235043 -0.674226 -0.674175 0.225564 0.225676 0.221002 0.304362 0.220904 0.302672 0.245920 0.267824 0.267476 0.246280 0.299728 0.300569 0.262939 0.220251 0.265014 0.220292 0.253571 0.223577 0.208002 0.253205 0.223348 0.208380
chargesum: 0.00000
title: Mulliken charges with hydrogens summed into heavy atoms:
elementType: O O O O O O O O N N C C C C C C C C C C C C C C C C C
charge: -0.246694 -0.246182 -0.117977 -0.117390 -0.236356 -0.236412 -0.262336 -0.262128 -0.129546 -0.129491 0.020155 0.146609 0.145592 0.087565 0.088393 -0.030867 -0.030861 0.153238 0.154228 0.081192 0.080702 0.284123 0.283470 0.249031 0.250262 0.010924 0.010758
polarizability: 2.24454269e+02 2.91224702e-02 2.39732201e+02 7.51700281e+00 -2.60660374e-01 1.84927595e+02
1716.lowfreq: -13.2767 -8.3161 -6.9664 -0.0008 -0.0007 -0.0005 18.9687 23.7665 33.3600
frequency: 18.9215 23.6832 33.2960 42.7424 49.8999 57.0672 59.5370 61.2473 83.0441 87.8655 92.7741 96.9624 102.0130 110.0764 127.1394 149.8108 153.1611 187.6090 188.3933 215.3146 234.2246 248.3315 249.6021 292.2583 300.8780 305.4728 311.4953 314.2913 321.1711 331.2648 333.6377 354.1886 387.2936 415.0019 448.0662 458.1955 473.8817 520.2638 531.4636 543.5077 577.2161 604.4222 638.4312 649.4764 667.0973 690.3873 691.9924 731.8480 735.3736 764.2502 799.5411 801.8296 802.1129 805.3078 810.2710 813.3452 841.2239 868.3326 868.8308 915.6469 940.6940 983.1698 1003.3688 1013.4882 1014.9382 1015.8365 1024.3671 1034.6865 1044.0695 1070.5648 1084.2134 1104.8697 1115.1665 1115.2651 1131.6454 1138.5307 1138.7000 1171.4210 1171.5665 1179.4171 1185.5696 1187.1168 1198.3791 1205.2087 1248.7422 1250.9485 1256.3807 1257.4151 1258.7835 1263.6549 1279.3491 1288.2878 1302.0574 1351.3141 1359.7280 1359.8910 1363.5115 1375.4466 1400.0668 1400.2872 1401.4740 1401.9313 1460.5780 1460.7085 1471.6088 1472.0080 1474.1894 1475.3611 1478.0832 1482.8850 1483.1146 1486.4146 1487.4255 1618.0084 1618.7474 1633.7724 1634.7147 1685.8514 1688.7963 2974.8477 2977.5611 2989.5143 2990.3764 2995.7550 2997.3728 2997.4915 3018.2350 3018.6013 3036.6063 3060.2596 3061.5912 3062.4479 3067.2476 3073.9916 3074.4238 3085.3140 3085.3917 3094.9244 3094.9632 3116.4659 3116.6453
redmass: 3.6822 3.2954 4.6140 6.2663 8.0763 5.2948 4.3368 4.2909 6.3372 3.4485 4.7410 8.6316 7.8155 5.9491 4.3409 2.5755 2.3979 4.4391 4.4200 3.1226 4.2262 1.4373 1.6055 2.3521 2.5850 3.7508 2.7004 5.2417 11.7583 5.1001 5.4878 4.1644 3.7989 3.7620 8.4931 6.1772 3.7577 5.4987 6.7511 5.0544 5.9301 5.5006 5.2655 4.9612 3.9557 5.3775 5.4715 6.2097 6.2007 1.7031 6.4332 1.5412 1.6483 2.3919 1.9928 2.8471 3.5308 3.6897 3.7533 2.7258 3.3947 2.0604 2.1694 2.1163 2.8062 2.6468 2.3674 2.0749 2.0659 2.8323 3.3174 3.6577 2.2818 2.2800 2.2215 1.4732 1.4717 3.4745 3.6391 2.4742 1.3986 1.3864 1.3811 1.2967 1.6626 1.5868 1.5834 1.1605 1.5406 1.3963 2.5805 1.6829 1.4068 1.4826 1.3566 1.3563 1.3438 1.3795 1.3175 1.3003 1.8063 1.8511 1.0391 1.0392 1.0753 1.0738 1.0839 1.0836 1.0954 1.0658 1.0624 1.1069 1.1123 9.5331 9.6968 10.0942 10.4528 12.5173 12.5639 1.0639 1.0641 1.0647 1.0647 1.0630 1.0362 1.0362 1.0592 1.0591 1.1013 1.0848 1.0851 1.0978 1.0983 1.0993 1.0995 1.1043 1.1042 1.0990 1.0989 1.1038 1.1037
irintensity: 0.0322 2.8292 0.0046 0.3467 3.7235 5.4167 1.7713 0.5313 0.0378 5.3766 0.2554 6.8846 0.0614 0.0230 5.1788 6.8438 2.4498 4.4545 4.8642 1.9569 0.3287 5.4159 0.1174 0.9022 8.2718 2.0716 0.8163 5.9857 1.9146 12.3666 7.3204 14.0907 7.1747 3.6421 0.7417 33.1281 0.5132 25.1710 0.8876 1.8383 0.9091 25.2937 0.0028 10.5891 0.0239 23.6512 0.2448 3.3648 4.0829 4.1286 0.5963 1.9955 17.0132 13.1035 1.6204 13.7544 2.6060 7.3050 3.0421 0.2596 0.0629 16.7231 4.8231 60.6545 24.2412 148.4288 16.8678 35.8564 3.7007 62.5447 1.8230 62.6437 1.1696 4.9853 0.2114 3.8244 4.7867 253.1598 163.5178 176.0937 48.4610 26.9505 1.1655 21.2268 0.3150 45.9382 54.9652 5.8542 38.4608 10.8708 100.5687 14.2241 16.3019 1.5520 5.8067 5.5662 3.9428 2.3848 2.1100 42.0057 20.3731 3.4318 11.6747 6.6020 3.9417 4.0654 4.9200 3.0612 47.3478 11.3702 26.5199 7.9967 13.2285 69.2502 346.6304 270.1273 183.3822 62.8961 294.8940 12.5715 30.7800 37.6354 55.3421 117.3290 12.7103 17.2669 28.2855 20.7381 29.2983 1.8948 1.6985 0.1820 3.5178 4.8183 3.6053 5.1568 5.5967 7.9706 32.0597 41.2120 25.8460
temp: 298.150 k
press: 1.00000 atm
elementType: 8 8 8 8 8 8 8 8 7 7 6 6 6 6 6 6 6 6 6 6 6 6 6 6 6 6 6 1 1 1 1 1 1 1 1 1 1 1 1 1 1 1 1 1 1 1 1 1 1
symmnumber: 1
zpe: 1002385.7 jmol-1
zpe.correction: 0.381789 hartree
zpe.thermalcorrener: 0.409454 hartree
zpe.thermalcorrenthalpy: 0.410399 hartree
zpe.thermalcorrgfe: 0.321108 hartree
zpe.sumelectzpe: -1370.267651 hartree
zpe.sumelectthermal: -1370.239985 hartree
zpe.sumelectthermalent: -1370.239041 hartree
zpe.sumelectthermalfe: -1370.328332 hartree
dipole: 0.0700 6.2793 -0.0984
dipole: 6.2804
quadrupole: -144.5542 -154.8354 -147.7364
quadrupole: -0.0069 -3.2385 0.1712
quadrupole: 4.4878 -5.7934 1.3056 -0.0069 -3.2385 0.1712
hfenergy: -1370.6494396 hartree
pointgroup: C01 [X(C17H22N2O8)]
dipole: 0.0420104 -2.4602033 0.2259985 debye
polarizability: 224.7490095|-0.6222229|239.3704722|-6.6637966|-4.454656|184.9945829 unknown
InChI: InChI=1S/C17H22N2O8/c1-3-26-16(24)10-8-18(14(22)12(10)20)6-5-7-19-9-11(13(21)15(19)23)17(25)27-4-2/h10-11H,3-9H2,1-2H3
charge 0 multiplicity 1
49 atoms
O  0.944843 -0.313233 -1.449773
O  -0.980718 -0.116686 1.36817
O  -1.564999 1.0972 -2.410248
O  1.491832 1.478143 2.112936
O  -3.698042 0.455857 -0.205666
O  3.662199 0.519468 0.06237
O  -3.535449 -1.770569 0.457162
O  3.508505 -1.784277 -0.242916
N  -0.562876 -2.14308 -1.441003
N  0.555391 -1.8954 1.68189
C  0.018643 -3.924485 0.262684
C  0.395465 -3.183533 -1.047518
C  -0.379024 -3.003002 1.446075
C  -1.971848 -2.440051 -1.806466
C  1.964407 -2.101734 2.106033
C  -2.665527 -1.059257 -1.753725
C  2.635163 -0.736703 1.828907
C  -0.205037 -0.812711 -1.598749
C  0.173987 -0.563906 1.613772
C  -1.500921 -0.065313 -1.976209
C  1.451971 0.258963 1.876648
C  -3.33883 -0.853211 -0.375281
C  3.309858 -0.748526 0.435955
C  -4.169799 0.852269 1.16672
C  4.129444 0.69903 -1.356738
C  -4.331976 2.366638 1.143626
C  4.30353 2.197931 -1.564407
H  -0.830979 -4.614753 0.094483
H  0.883687 -4.561578 0.531349
H  0.487801 -3.930192 -1.862297
H  1.3748 -2.683949 -0.943036
H  -0.460978 -3.620035 2.363688
H  -1.367269 -2.544637 1.264267
H  -2.022669 -2.881962 -2.820443
H  -2.425694 -3.135651 -1.081705
H  2.437943 -2.900391 1.511918
H  2.009929 -2.366874 3.18004
H  -3.432478 -0.911385 -2.533142
H  3.394431 -0.446479 2.574891
H  -3.395761 0.515957 1.877142
H  -5.115577 0.318327 1.370129
H  3.348212 0.264937 -2.0034
H  5.069926 0.132553 -1.480737
H  -3.371286 2.852709 0.90657
H  -5.079517 2.678425 0.394215
H  -4.665868 2.717757 2.137306
H  3.348018 2.723129 -1.401347
H  5.056995 2.613508 -0.873511
H  4.635939 2.390961 -2.600926
