program: Gaussian 09
title: 000244308
version: EM64L-G09RevD.01
frameworkgroup: C1[X(C11H14N2O2)]
method: RPBEPBE
basis: SDD
operation: Freq
keyword: #p
keyword: freq=noraman
keyword: PBEPBE/SDD
title: #p freq=noraman PBEPBE/SDD
converged: YES YES NO NO
title: Mulliken charges:
elementType: O O N N C C C C C C C C C C C H H H H H H H H H H H H H H
charge: -0.216218 -0.096157 -0.170944 0.011887 0.017010 -0.425659 -0.422042 -0.393345 -0.394044 -0.394227 -0.419330 -0.218170 0.140702 0.009340 -0.152886 0.192174 0.251070 0.203198 0.198197 0.253533 0.210124 0.190213 0.189379 0.209146 0.204286 0.205296 0.248619 0.260511 0.308337
chargesum: 0.00000
title: Mulliken charges with hydrogens summed into heavy atoms:
elementType: O O N N C C C C C C C C C C C
charge: -0.216218 -0.096157 -0.170944 0.011887 0.209183 0.028608 0.029688 0.006993 0.004481 0.015356 0.089801 0.090167 0.140702 0.009340 -0.152886
polarizability: 1.70457609e+02 3.18942899e+00 1.23227791e+02 5.15279085e+00 -2.06193643e+00 9.89102720e+01
1716.lowfreq: -0.0006 -0.0002 0.0006 7.1870 9.6243 15.6631 33.2288 64.2640 65.6430
frequency: 32.5990 64.0614 65.6266 81.0145 126.8720 157.8552 201.6388 217.7949 224.5664 260.1728 321.4151 330.5023 345.7407 413.2333 424.9438 444.4045 465.2705 474.6653 493.8875 575.2892 624.4972 652.9312 702.5877 788.8100 789.7790 792.4423 843.1097 875.7122 894.6568 896.6111 922.2911 957.4892 1003.9293 1026.4899 1041.4320 1048.7729 1055.0932 1074.9246 1076.9872 1112.9647 1125.9891 1162.1447 1176.8507 1190.1068 1211.8440 1237.2373 1250.9310 1258.0686 1269.7746 1294.3671 1306.6326 1325.3566 1330.4678 1336.0772 1343.2570 1345.1575 1353.3033 1410.3344 1465.3442 1466.4726 1470.2573 1473.2251 1483.6965 1493.6863 1634.6572 1691.1541 2203.7790 2964.3395 2965.6646 2970.7294 2979.2102 2986.2449 2989.8617 2992.9618 2994.0817 3033.7101 3037.1939 3044.9019 3057.1216 3057.7012 3064.3200
redmass: 4.7179 5.6329 4.6237 4.1579 7.4465 4.5401 3.5781 4.1114 1.7915 4.7420 9.9041 1.9445 5.4573 6.1875 3.7826 3.3829 5.0888 2.8041 2.8061 4.5305 4.0519 4.8151 6.9035 3.0729 1.5025 3.5815 2.3115 2.1964 2.4923 1.5642 1.7744 2.8879 2.9435 2.2310 5.4936 1.8134 1.2594 1.3277 2.6908 2.5193 2.6912 1.2771 2.5776 1.5099 1.2489 1.7590 1.3286 1.3026 1.4072 2.1825 1.2775 1.3405 1.3505 1.3620 1.4643 1.4671 1.5111 1.7133 1.0867 1.0870 1.0843 1.0862 1.0897 1.0930 9.8615 12.8774 12.5450 1.0645 1.0649 1.0832 1.0618 1.0805 1.0614 1.0623 1.0624 1.0971 1.0941 1.1036 1.1029 1.1044 1.1019
irintensity: 0.9681 1.2104 6.0970 2.1770 5.0296 0.7861 1.9468 2.1697 0.0370 1.1203 5.3066 0.8663 0.3986 2.7319 4.0095 1.2320 7.7710 1.2890 3.7049 3.5570 4.1450 0.9862 2.7404 1.9031 0.5263 0.2297 2.2488 28.9906 11.1432 18.3688 0.0752 3.3501 9.0306 0.5034 36.7100 1.1557 0.5756 0.8366 10.3017 0.0515 40.5415 2.9482 14.9187 0.7032 16.5557 41.3806 10.8037 1.3156 0.0267 26.4050 0.2321 3.0908 1.3315 0.4290 1.1401 19.6665 8.0871 0.6371 6.5065 6.3060 10.8394 17.5150 7.9609 1.4554 153.2716 228.8115 22.3272 20.2526 47.6428 20.0461 28.5722 1.0218 37.2845 21.1923 38.9487 63.1480 47.2726 36.5981 3.8137 15.1392 57.5107
temp: 298.150 k
press: 1.00000 atm
elementType: 8 8 7 7 6 6 6 6 6 6 6 6 6 6 6 1 1 1 1 1 1 1 1 1 1 1 1 1 1
symmnumber: 1
zpe: 618177.9 jmol-1
zpe.correction: 0.235452 hartree
zpe.thermalcorrener: 0.249306 hartree
zpe.thermalcorrenthalpy: 0.250250 hartree
zpe.thermalcorrgfe: 0.194014 hartree
zpe.sumelectzpe: -686.377806 hartree
zpe.sumelectthermal: -686.363952 hartree
zpe.sumelectthermalent: -686.363008 hartree
zpe.sumelectthermalfe: -686.419244 hartree
dipole: 5.2934 -4.3050 2.8228
dipole: 7.3838
quadrupole: -110.2669 -100.4764 -84.6455
quadrupole: -1.7850 -8.2459 0.6999
quadrupole: -11.8040 -2.0135 13.8174 -1.7850 -8.2459 0.6999
hfenergy: -686.613258 hartree
pointgroup: C01 [X(C11H14N2O2)]
dipole: 2.0930679 1.5999606 -1.2240326 debye
polarizability: 170.6327278|-3.2941167|122.6287501|-3.696929|-4.2673313|99.3341941 unknown
InChI: InChI=1S/C11H14N2O2/c12-6-8-7-13(11(15)10(8)14)9-4-2-1-3-5-9/h8-9H,1-5,7H2
charge 0 multiplicity 1
29 atoms
O  0.103517 -2.082013 0.531952
O  -2.902085 -1.865936 0.396173
N  -0.071646 0.163309 -0.238072
N  -4.597768 1.580447 0.213626
C  1.368459 0.537762 -0.21707
C  1.94138 0.500983 1.225532
C  2.198145 -0.351806 -1.179439
C  3.430426 0.922928 1.228978
C  3.686221 0.074133 -1.163121
C  4.267512 0.043288 0.270279
C  -1.109965 1.174192 -0.538209
C  -2.4236 0.348017 -0.687063
C  -0.556243 -1.077956 0.149663
C  -2.092278 -1.003723 0.025248
C  -3.624292 1.02518 -0.194613
H  1.416613 1.585352 -0.582896
H  1.841579 -0.527263 1.619464
H  1.348181 1.16815 1.880697
H  1.783768 -0.277332 -2.203512
H  2.102737 -1.405289 -0.858288
H  3.828466 0.85576 2.259119
H  3.518718 1.986243 0.921568
H  3.785207 1.100332 -1.575492
H  4.266361 -0.593505 -1.827872
H  5.319924 0.385543 0.261215
H  4.27008 -1.001491 0.641499
H  -0.860523 1.723198 -1.462847
H  -1.198754 1.907212 0.286119
H  -2.574339 0.089284 -1.755635
