program: Gaussian 09
title: 000244300
version: EM64L-G09RevD.01
frameworkgroup: C1[X(C20H18N4O2)]
method: RPBEPBE
basis: SDD
operation: Freq
keyword: #p
keyword: freq=noraman
keyword: PBEPBE/SDD
title: #p freq=noraman PBEPBE/SDD
converged: YES YES NO NO
title: Mulliken charges:
elementType: O O N N N N C C C C C C C C C C C C C C C C C C C C H H H H H H H H H H H H H H H H H H
charge: -0.278330 -0.278386 -0.467268 -0.467229 -0.698389 -0.698385 0.265171 0.264816 -0.371570 -0.350691 -0.350633 -0.371937 0.117418 0.117548 0.503665 0.503629 -0.329076 -0.329002 -0.448929 -0.448816 0.515514 0.515520 -0.418102 -0.418099 -0.402570 -0.402575 0.276845 0.212984 0.212873 0.276928 0.306383 0.306469 0.306640 0.306619 0.214635 0.214628 0.217922 0.217923 0.217651 0.217651 0.303676 0.306600 0.306602 0.303677
chargesum: 0.00000
title: Mulliken charges with hydrogens summed into heavy atoms:
elementType: O O N N N N C C C C C C C C C C C C C C C C C C C C
charge: -0.278330 -0.278386 -0.160884 -0.160759 -0.088114 -0.088106 0.265171 0.264816 -0.094725 -0.137707 -0.137760 -0.095009 0.117418 0.117548 0.503665 0.503629 -0.022436 -0.022383 -0.234294 -0.234188 0.515514 0.515520 -0.200180 -0.200176 -0.184919 -0.184924
polarizability: 6.77437751e+02 1.66950849e+01 2.30773568e+02 8.06574431e-02 9.55376142e-03 1.16489865e+02
1716.lowfreq: -0.0012 -0.0006 0.0014 1.5299 2.0110 8.7836 12.0925 25.3611 27.0279
frequency: 12.0765 25.3608 27.0270 41.5437 49.7078 62.3564 79.1172 81.3310 102.9241 135.6063 149.3460 178.9805 181.8817 244.6105 266.5260 285.6185 316.2178 319.0890 334.2859 335.3987 355.6555 357.0426 360.7986 378.3130 388.3449 394.0025 404.8152 409.9902 410.8062 429.1252 475.8107 494.2626 519.9142 521.5192 532.2049 543.5711 624.6878 629.0114 633.4809 636.7593 636.7956 664.2626 691.9616 699.3934 720.5599 720.8057 768.3350 780.3624 787.4940 803.8439 803.9247 830.5328 835.1535 837.8124 837.9391 848.6905 856.2617 862.0094 879.8730 922.7375 922.7776 978.4027 978.5201 982.3423 991.3693 996.2174 996.2352 1008.1470 1018.2863 1018.5393 1084.2256 1099.6600 1122.1438 1134.6801 1134.9521 1188.5183 1188.8214 1192.8867 1244.3601 1246.0587 1253.6280 1259.0445 1307.5111 1307.7193 1310.8480 1326.1337 1326.7491 1367.9473 1381.4516 1382.0991 1408.1221 1434.5071 1435.1075 1488.5722 1508.6661 1512.8650 1518.2493 1518.4114 1550.1189 1582.2734 1590.1308 1594.3339 1603.8865 1614.5394 1635.2071 1635.5803 1646.9153 1648.3302 3104.4033 3104.4169 3117.1743 3118.5958 3125.8048 3125.8258 3135.9882 3136.0374 3161.4791 3164.4302 3192.5431 3192.5563 3533.3323 3533.4487 3568.7916 3568.9629 3709.2963 3709.2991
redmass: 6.3749 3.8844 5.1294 5.1703 4.5215 5.6603 7.3775 5.4653 6.1297 6.3986 4.9317 4.8247 5.9338 6.5223 5.0865 6.3403 7.8091 5.7668 1.2209 1.2179 1.3795 1.0600 2.3014 5.0657 3.3313 3.2889 2.8688 2.8112 2.8182 5.0966 4.7078 7.6938 2.3027 2.3211 6.3881 4.6658 1.8801 1.2202 4.0359 3.1232 6.5512 6.2660 4.2765 4.6632 3.4860 3.4953 5.0334 4.6244 4.9160 1.3976 1.3943 5.4120 5.1921 1.5850 1.6165 1.4021 2.3798 4.8798 4.0999 1.3845 1.3842 1.3142 1.3133 1.3870 1.3806 2.8651 2.8745 3.0738 1.4296 1.4390 5.0789 2.7899 1.3769 1.2268 1.2335 1.1137 1.1028 1.1482 3.2664 2.7205 2.0007 1.8277 1.5892 1.9061 1.5024 2.1311 2.1891 5.1117 5.0118 5.2843 4.1915 3.7972 3.8840 2.3089 2.2582 2.4006 3.2138 3.0782 6.6321 9.5354 6.0078 3.8359 4.8218 6.2714 1.6059 1.5415 2.5162 2.7135 1.0877 1.0877 1.0892 1.0888 1.0908 1.0908 1.0957 1.0957 1.0937 1.0949 1.0944 1.0944 1.0757 1.0757 1.0448 1.0449 1.1041 1.1041
irintensity: 2.6155 0.8037 0.8414 0.0888 0.2444 0.3046 7.2744 0.4366 7.8261 0.2982 7.2877 6.8073 10.4323 0.2350 1.2206 2.2786 0.2990 18.0917 471.1031 84.4896 0.2220 3.4779 83.4682 4.8821 0.7889 5.5756 0.0010 0.0119 0.0240 1.1360 0.1808 25.4870 11.6128 52.9208 29.1966 8.8993 37.9342 17.9905 7.0830 15.6843 1.3452 3.1376 44.0630 31.9817 0.1548 1.9110 1.0826 2.2357 0.1007 10.9888 62.1522 28.8494 0.3006 19.3706 129.9152 0.8963 32.6312 39.2452 11.7533 0.1179 1.1588 0.3497 5.3420 1.7733 2.1715 0.0170 0.5766 16.0905 0.2078 2.8868 0.0814 43.8260 42.4476 5.1599 40.2101 1.2467 101.3934 0.1678 0.1078 36.9071 0.5041 123.2883 1.9646 306.1249 4.9110 24.3044 0.0459 0.7844 123.1165 8.0287 4.8675 83.9854 1.5278 97.2869 15.6478 636.6970 4.4651 413.6868 19.4715 280.8850 4.7411 66.9246 22.8215 0.0361 7.7741 0.2129 822.7338 2.5812 42.0190 0.7227 50.7711 0.0832 52.8623 6.6285 51.4578 4.8252 4.4995 0.0204 14.0005 0.7490 14.6365 4.2835 292.4254 1.6242 15.0084 26.3857
temp: 298.150 k
press: 1.00000 atm
elementType: 8 8 7 7 7 7 6 6 6 6 6 6 6 6 6 6 6 6 6 6 6 6 6 6 6 6 1 1 1 1 1 1 1 1 1 1 1 1 1 1 1 1 1 1
symmnumber: 1
zpe: 900168.1 jmol-1
zpe.correction: 0.342856 hartree
zpe.thermalcorrener: 0.366121 hartree
zpe.thermalcorrenthalpy: 0.367065 hartree
zpe.thermalcorrgfe: 0.287699 hartree
zpe.sumelectzpe: -1140.621425 hartree
zpe.sumelectthermal: -1140.598161 hartree
zpe.sumelectthermalent: -1140.597217 hartree
zpe.sumelectthermalfe: -1140.676582 hartree
dipole: 0.0030 -0.0024 2.8956
dipole: 2.8956
quadrupole: -47.4102 -144.9819 -161.1670
quadrupole: 23.4161 0.0318 -0.0020
quadrupole: 70.4428 -27.1289 -43.3140 23.4161 0.0318 -0.0020
hfenergy: -1140.9642813 hartree
pointgroup: C01 [X(C20H18N4O2)]
dipole: 0.0011932 0.0001872 1.1392168 debye
polarizability: 677.4871064|16.021278|230.7241214|0.0537595|-0.1039405|116.489956 unknown
InChI: InChI=1S/C20H18N4O2/c21-15-5-9-17(10-6-15)23-19(25)13-1-2-14(4-3-13)20(26)24-18-11-7-16(22)8-12-18/h1-12,23-24H,21-22H2
charge 0 multiplicity 1
44 atoms
O  -3.185162 1.911374 -0.693813
O  3.183921 -1.91088 -0.692299
N  -3.743957 -0.224951 0.10689
N  3.74435 0.226967 0.103057
N  -9.413407 -0.127502 0.500218
N  9.413281 0.124169 0.502443
C  -1.393697 0.314953 -0.32596
C  1.393568 -0.312539 -0.327664
C  -0.419473 1.345559 -0.350431
C  0.95378 1.039181 -0.348369
C  -0.953953 -1.036806 -0.344577
C  0.419293 -1.343188 -0.348269
C  -2.841905 0.739925 -0.329091
C  2.841756 -0.737593 -0.332486
C  -5.165735 -0.144043 0.186432
C  5.165957 0.14469 0.184196
C  -5.912041 0.996536 -0.216097
C  5.911515 -0.997115 -0.216235
C  -5.862271 -1.272551 0.695501
C  5.863116 1.273072 0.692691
C  -8.019977 -0.135651 0.398806
C  8.019967 0.133628 0.399564
C  -7.314548 0.992767 -0.109626
C  7.313913 -0.99466 -0.108292
C  -7.263446 -1.274105 0.802136
C  7.264181 1.273323 0.800776
H  -0.772556 2.380953 -0.388823
H  1.670929 1.867675 -0.406289
H  -1.671229 -1.865398 -0.399513
H  0.772305 -2.378665 -0.385084
H  -3.343212 -1.098525 0.454379
H  3.344142 1.101299 0.449248
H  -5.381728 1.868942 -0.601796
H  5.380717 -1.8694 -0.601544
H  -5.30292 -2.163373 1.011898
H  5.304348 2.16483 1.007478
H  -7.874256 1.88186 -0.425366
H  7.873042 -1.884685 -0.42243
H  -7.776502 -2.158857 1.197761
H  7.777727 2.158012 1.195905
H  -9.915384 -0.931345 0.864546
H  -9.950289 0.684427 0.211278
H  9.949631 -0.688645 0.215007
H  9.915703 0.927927 0.866344
