program: Gaussian 09
title: 000244295
version: EM64L-G09RevD.01
frameworkgroup: C1[X(C17H24O7)]
method: RPBEPBE
basis: SDD
operation: Freq
keyword: #pfreq=noraman
keyword: PBEPBE/SDD
title: #p freq=noraman PBEPBE/SDD
converged: YES YES NO NO
title: Mulliken charges:
elementType: O O O O O O O C C C C C C C C C C C C C C C C C H H H H H H H H H H H H H H H H H H H H H H H H
charge: -0.274528 -0.258551 -0.240064 -0.279481 -0.264970 -0.218880 -0.246656 -0.596808 -0.301363 0.559958 -0.558712 -0.608216 0.271907 0.251082 0.238166 0.279763 0.039990 -0.260498 -0.260238 -0.666707 -0.664143 -0.537374 -0.536787 -0.519188 0.228596 0.241622 0.274312 0.293488 0.244187 0.216637 0.241150 0.228984 0.234320 0.217269 0.254378 0.225555 0.219360 0.248345 0.227644 0.245216 0.209279 0.220542 0.237700 0.226661 0.230114 0.211767 0.248900 0.226269
chargesum: 0.00000
title: Mulliken charges with hydrogens summed into heavy atoms:
elementType: O O O O O O O C C C C C C C C C C C C C C C C C
charge: -0.274528 -0.258551 -0.240064 -0.279481 -0.264970 -0.218880 -0.246656 -0.126590 -0.027051 0.559958 -0.265223 -0.364029 0.271907 0.251082 0.238166 0.279763 0.039990 0.197290 0.203066 0.030496 0.031206 0.137664 0.157688 0.167748
polarizability: 2.38185728e+02 1.35473940e+01 2.36924080e+02 1.42556723e+01 -1.51823991e+01 1.61448929e+02
1716.lowfreq: -10.6620 -6.1384 -0.0005 -0.0004 0.0002 3.3390 11.2800 24.1471 27.3732
frequency: 10.7212 24.0729 27.3640 34.9684 43.4557 54.2439 60.7847 64.1678 72.2057 79.5552 99.6189 105.8857 107.3854 125.0044 143.0524 149.2042 171.8283 182.5443 196.8310 199.4930 203.7728 216.4333 236.3264 252.5270 263.2355 280.7162 287.7715 293.8322 322.7843 330.7590 351.1080 363.8153 392.0486 429.7910 433.0994 458.5330 501.1239 514.2562 539.7957 565.8674 587.5851 626.1557 638.4593 660.2982 697.8158 721.0451 742.8872 764.5981 775.7814 808.7443 815.1561 828.2182 839.3576 852.7905 866.0235 878.0186 895.8126 943.7616 953.0855 983.8800 995.7596 1011.8797 1022.1611 1047.4483 1088.0373 1093.9563 1095.9858 1105.0338 1111.1657 1111.3977 1111.6383 1135.2769 1145.4525 1156.0492 1156.9786 1157.4260 1158.0810 1161.2352 1199.8408 1216.4109 1226.8321 1238.4157 1276.6071 1276.7406 1307.2795 1314.1123 1341.5281 1355.6158 1357.0167 1385.8966 1388.7995 1391.0569 1415.6408 1419.1702 1442.8134 1447.6413 1455.5505 1456.5530 1457.1740 1460.8945 1462.6327 1462.7513 1465.1977 1466.0262 1470.4334 1474.2634 1477.8320 1484.0532 1484.5111 1493.5364 1592.4328 1598.9185 1638.1288 1646.5098 2947.6643 2965.5645 2969.8141 2992.5972 2992.9236 3008.7393 3023.0124 3027.1597 3032.9275 3034.1327 3055.0128 3070.7552 3071.4650 3087.3489 3087.9057 3091.8109 3095.1536 3117.4924 3117.8900 3119.6935 3122.3550 3122.4650 3150.8198 3173.6604
redmass: 4.4264 3.6220 4.1804 3.7334 3.1493 3.1233 3.0062 3.3235 3.1460 5.7685 5.6577 3.7736 3.9749 3.9894 4.1936 1.2409 2.6025 2.9852 1.9630 1.9088 1.3288 2.9515 1.7487 1.9097 2.1600 2.7717 1.7281 3.2505 3.5678 4.6204 4.3766 2.9944 4.2519 4.2718 3.6997 5.7099 4.5468 6.8585 6.6329 5.2154 4.9071 3.6096 5.0252 3.9498 4.9430 4.9086 3.3786 3.6385 2.0491 1.3947 1.6909 2.7428 2.2101 2.4202 4.8088 1.8266 3.1229 5.1149 9.0111 2.3591 3.6853 3.5650 3.1863 3.7933 6.3861 2.2946 2.1641 1.2606 1.4061 2.3069 1.2696 2.6474 1.9377 1.6301 1.5556 1.6420 1.6706 1.6535 1.2670 1.9373 1.3576 1.7101 1.1197 1.1197 2.9426 1.8534 1.5978 1.3237 1.3475 7.1060 1.2343 1.2320 1.7138 1.2195 1.2038 1.4479 1.0943 1.0897 1.0963 1.1348 1.0439 1.0476 1.0543 1.0494 1.1863 1.0699 1.0540 1.0521 1.0519 2.4803 7.3728 6.2223 9.3785 9.7816 1.0341 1.0322 1.0322 1.0360 1.0361 1.0630 1.0788 1.0594 1.1022 1.0598 1.1040 1.1012 1.1028 1.0981 1.0973 1.1034 1.1026 1.1056 1.1030 1.0986 1.1038 1.1033 1.0903 1.0913
irintensity: 0.1832 0.4639 0.4891 0.0340 0.1897 2.2556 7.0164 7.0397 2.2155 2.7952 0.2694 0.0533 3.7862 1.3252 1.3197 1.4194 0.8040 6.3805 0.5153 1.4450 3.2732 4.1780 2.1184 0.6567 0.1554 3.8675 0.2456 9.0205 16.3814 4.7801 0.0120 17.0774 5.6816 2.5764 4.1689 0.7804 8.6559 5.9743 18.9808 3.5143 1.4110 4.2027 7.5151 9.0158 11.3990 13.6005 9.9043 16.9882 3.9082 5.1104 10.3303 19.0190 7.8162 2.0039 3.2009 37.4728 2.5274 10.4802 30.0594 3.2240 5.0904 15.8894 111.3784 70.7266 288.6999 123.0967 14.4330 19.0881 39.6004 163.7366 5.8809 125.7869 119.1551 60.7590 18.1847 31.9440 22.1892 44.9278 49.7593 42.2293 50.5369 65.8040 4.4911 4.0799 98.6697 73.0239 20.2811 6.3309 9.9932 2.0894 23.7658 24.3228 87.7897 9.3390 1.8096 51.4780 0.6207 4.4541 10.1590 33.9627 14.1035 6.3979 8.4336 15.3945 60.6513 50.6412 11.2989 11.5718 12.9856 68.8061 117.0132 33.7894 145.7865 129.4286 72.2614 62.1011 75.6393 21.1453 21.7250 18.4018 12.7554 31.5171 54.7507 23.4409 40.9703 34.9246 9.4260 27.9592 31.9377 2.8968 2.0590 31.2060 24.5319 29.6304 49.3830 9.7281 8.9017 4.6791
temp: 298.150 k
press: 1.00000 atm
elementType: 8 8 8 8 8 8 8 6 6 6 6 6 6 6 6 6 6 6 6 6 6 6 6 6 1 1 1 1 1 1 1 1 1 1 1 1 1 1 1 1 1 1 1 1 1 1 1 1
symmnumber: 1
zpe: 1013605.5 jmol-1
zpe.correction: 0.386062 hartree
zpe.thermalcorrener: 0.413541 hartree
zpe.thermalcorrenthalpy: 0.414485 hartree
zpe.thermalcorrgfe: 0.324513 hartree
zpe.sumelectzpe: -1186.872430 hartree
zpe.sumelectthermal: -1186.844950 hartree
zpe.sumelectthermalent: -1186.844006 hartree
zpe.sumelectthermalfe: -1186.933978 hartree
dipole: -4.5336 2.1676 0.1280
dipole: 5.0268
quadrupole: -142.2705 -117.5085 -137.6438
quadrupole: 10.5953 2.8521 -5.7595
quadrupole: -9.7962 14.9658 -5.1695 10.5953 2.8521 -5.7595
hfenergy: -1187.2584916 hartree
pointgroup: C01 [X(C17H24O7)]
dipole: 1.9572692 -0.1700852 -0.2268287 debye
polarizability: 223.0070338|13.448627|244.682157|-26.2848168|12.324914|168.8695465 unknown
InChI: InChI=1S/C17H24O7/c1-6-23-16(18)12(17(19)24-7-2)8-11-9-13(20-3)15(22-5)14(10-11)21-4/h9-10,12H,6-8H2,1-5H3
charge 0 multiplicity 1
48 atoms
O  2.032482 -1.995187 -0.755008
O  3.446597 1.727465 -0.268716
O  -3.164455 -2.707828 -0.32418
O  -3.190147 1.910023 0.914691
O  -4.341859 -0.631203 0.93668
O  1.715475 -0.51488 1.023532
O  1.393617 2.707086 -0.773194
C  0.483382 0.257489 -2.116561
C  1.833648 0.317186 -1.319738
C  -0.77432 0.044381 -1.280548
C  -1.361178 1.114481 -0.569151
C  -1.361859 -1.241178 -1.224538
C  1.861968 -0.726858 -0.197717
C  2.1496 1.708879 -0.764124
C  -2.528432 -1.462595 -0.450039
C  -2.531828 0.898387 0.193634
C  -3.132245 -0.391848 0.268007
C  2.003469 -3.146057 0.204171
C  3.916028 3.004354 0.35742
C  3.386848 -3.375655 0.817882
C  4.503718 3.941417 -0.701142
C  -2.604606 -3.820969 -1.088595
C  -2.632601 3.263194 0.831331
C  -4.330476 -0.421189 2.399169
H  0.577629 -0.568894 -2.842371
H  0.405108 1.199865 -2.688946
H  2.653632 0.058772 -2.016244
H  -0.88679 2.097471 -0.61661
H  -0.898407 -2.061779 -1.780932
H  1.680923 -3.994163 -0.421292
H  1.247519 -2.931335 0.979907
H  4.6721 2.669644 1.084781
H  3.062485 3.468835 0.88104
H  3.363251 -4.273005 1.463968
H  3.686583 -2.513797 1.436953
H  4.146077 -3.534973 0.032747
H  4.923625 4.839565 -0.211248
H  3.725257 4.268891 -1.410393
H  5.314352 3.444345 -1.26156
H  -3.256034 -4.678235 -0.862719
H  -1.565601 -4.050033 -0.774973
H  -2.621958 -3.615635 -2.177138
H  -3.295976 3.883876 1.451946
H  -2.639069 3.634568 -0.211323
H  -1.599881 3.300532 1.228029
H  -3.590562 -1.090385 2.879556
H  -4.10729 0.631997 2.6426
H  -5.345598 -0.685923 2.733058
