program: Gaussian 09
title: 000244292
version: EM64L-G09RevD.01
frameworkgroup: C1[X(C12H13NO2)]
method: RPBEPBE
basis: SDD
operation: Freq
keyword: #p
keyword: freq=noraman
keyword: PBEPBE/SDD
title: #p freq=noraman PBEPBE/SDD
converged: YES YES NO YES
title: Mulliken charges:
elementType: O O N C C C C C C C C C C C C H H H H H H H H H H H H H
charge: -0.200082 -0.208719 -0.290118 0.300397 -0.689727 -0.700859 -0.700863 0.070122 0.114863 0.160128 0.196716 -0.352196 -0.359331 -0.210407 -0.213132 0.234938 0.206065 0.234934 0.266061 0.217708 0.212065 0.217710 0.212073 0.266047 0.269829 0.270312 0.237644 0.237821
chargesum: 0.00000
title: Mulliken charges with hydrogens summed into heavy atoms:
elementType: O O N C C C C C C C C C C C C
charge: -0.200082 -0.208719 -0.290118 0.300397 -0.013789 -0.005026 -0.005033 0.070122 0.114863 0.160128 0.196716 -0.082367 -0.089019 0.027236 0.024690
polarizability: 1.92040041e+02 -5.06080629e-01 1.50951636e+02 -9.60833059e-03 -7.96807443e-04 7.87885790e+01
1716.lowfreq: -2.5567 -0.0006 0.0005 0.0006 7.2705 8.9608 42.4456 62.9982 132.5388
frequency: 42.3806 62.9730 132.5387 171.3624 176.0805 191.2592 226.4664 247.6388 270.6146 271.5617 307.8958 316.5025 356.1038 357.6598 404.9543 408.9419 451.9210 471.2028 502.8898 526.9923 568.7720 658.0774 671.4124 692.8754 713.1213 778.0040 786.1868 795.8239 854.2445 873.8428 907.1126 919.3643 930.2948 954.0440 975.2452 1003.1515 1005.5273 1010.4565 1037.2950 1069.9148 1081.8505 1155.0444 1171.8348 1181.2574 1217.6620 1232.2290 1260.3754 1280.0716 1290.2061 1375.7800 1383.5775 1410.8703 1417.1599 1450.2014 1453.2119 1458.2894 1461.6739 1468.7566 1476.5051 1485.4992 1501.7204 1613.4847 1621.5807 1623.1657 1669.6226 2989.4186 2992.2257 3001.0594 3082.5956 3085.6772 3097.3212 3110.5018 3114.9322 3121.1608 3138.0020 3152.2627 3164.3454 3173.7500
redmass: 3.4754 4.4639 4.9628 3.7463 4.0660 1.7507 1.9458 1.1046 3.5378 4.7138 1.0532 3.3048 8.2699 2.4271 2.9548 2.5901 4.8532 3.6513 2.7973 7.4512 8.7111 4.7718 6.9453 7.4199 2.9677 4.0960 4.3463 1.7991 7.4803 3.5033 1.3882 1.7135 1.6149 1.2003 1.4110 2.4443 1.3437 2.1126 1.3866 2.2833 2.6511 1.7824 2.0858 1.4414 2.6804 3.0180 3.4550 1.5750 6.5388 1.1943 1.1963 1.2291 6.3846 1.0478 2.4660 2.6453 1.0611 1.0492 1.0676 1.0526 1.0569 9.1440 8.7531 8.1650 11.9939 1.0357 1.0364 1.0376 1.1001 1.0994 1.0979 1.1002 1.0994 1.1008 1.0864 1.0906 1.0955 1.1003
irintensity: 0.7264 4.3435 0.0436 1.8029 1.2040 0.0444 1.3700 0.2024 1.8407 2.0264 0.2197 0.3831 16.0063 0.4183 1.9238 1.1342 0.0050 0.1373 4.8430 9.7440 2.7227 0.2570 6.8531 1.5559 77.4356 2.2325 5.6664 28.3035 16.8598 10.6936 0.0061 0.9307 4.4440 0.2340 2.2906 60.3528 0.0023 3.2796 0.0525 40.1242 8.2711 8.3200 4.2376 1.8845 85.4386 19.4575 19.4051 23.1961 381.3271 31.6351 39.0241 16.3242 13.6420 0.8405 10.6290 0.4624 5.1999 1.2690 37.8892 5.9596 29.9448 270.5770 141.3912 13.4761 50.8517 31.5048 11.9660 35.3207 13.6348 20.5946 62.8100 0.0002 17.5590 24.1034 2.0316 6.1430 6.2494 21.5569
temp: 298.150 k
press: 1.00000 atm
elementType: 8 8 7 6 6 6 6 6 6 6 6 6 6 6 6 1 1 1 1 1 1 1 1 1 1 1 1 1
symmnumber: 1
zpe: 586574.4 jmol-1
zpe.correction: 0.223414 hartree
zpe.thermalcorrener: 0.237012 hartree
zpe.thermalcorrenthalpy: 0.237956 hartree
zpe.thermalcorrgfe: 0.183834 hartree
zpe.sumelectzpe: -669.220623 hartree
zpe.sumelectthermal: -669.207025 hartree
zpe.sumelectthermalent: -669.206081 hartree
zpe.sumelectthermalfe: -669.260203 hartree
dipole: -1.8705 -0.1373 0.0002
dipole: 1.8755
quadrupole: -68.3567 -98.5265 -89.3619
quadrupole: 0.3515 -0.0020 0.0007
quadrupole: 17.0584 -13.1115 -3.9469 0.3515 -0.0020 0.0007
hfenergy: -669.4440374 hartree
pointgroup: C01 [X(C12H13N1O2)]
dipole: 0.7356699 -0.0570519 -0.0004762 debye
polarizability: 192.0434638|0.3367944|150.9481363|-0.0753247|-0.0448911|78.788656 unknown
InChI: InChI=1S/C12H13NO2/c1-12(2,3)13-10(14)8-6-4-5-7-9(8)11(13)15/h4-7H,1-3H3
charge 0 multiplicity 1
28 atoms
O  -0.510334 2.441228 0.00168
O  -0.657159 -2.302001 0.004674
N  -1.013125 0.075268 0.003622
C  -2.531318 0.02359 0.003972
C  -3.153895 1.440894 0.00316
C  -2.989805 -0.729091 -1.275244
C  -2.989289 -0.727336 1.284404
C  -0.162011 1.234958 0.002576
C  -0.219258 -1.122451 0.004405
C  1.246157 0.719407 0.001842
C  1.211715 -0.689851 0.002783
C  2.458739 1.424827 0.000365
C  2.387839 -1.455147 0.002225
C  3.656841 0.663832 -0.000166
C  3.621978 -0.754661 0.000745
H  -2.870264 2.023573 -0.887403
H  -4.251763 1.311867 0.003519
H  -2.869825 2.024761 0.892808
H  -2.597142 -1.757741 -1.300813
H  -2.655869 -0.192022 -2.181143
H  -4.093484 -0.776136 -1.290714
H  -2.655022 -0.188998 2.189427
H  -4.092962 -0.774376 1.300355
H  -2.596597 -1.755939 1.311258
H  2.470213 2.519224 -0.000376
H  2.345758 -2.548739 0.002969
H  4.624726 1.176662 -0.001326
H  4.563357 -1.314599 0.0003
