program: Gaussian 09
title: 000244291
version: EM64L-G09RevD.01
frameworkgroup: C1[X(C11H23NO)]
method: RPBEPBE
basis: SDD
operation: Freq
keyword: #p
keyword: freq=noraman
keyword: PBEPBE/SDD
title: #p freq=noraman PBEPBE/SDD
converged: YES YES NO NO
title: Mulliken charges:
elementType: O N C C C C C C C C C C C H H H H H H H H H H H H H H H H H H H H H H H
charge: -0.452449 -0.298321 -0.050580 -0.443284 -0.409703 -0.391466 -0.392554 -0.385004 -0.377369 -0.382622 -0.363174 -0.360757 -0.340394 0.197875 0.176019 0.221967 0.207460 0.177235 0.196796 0.191687 0.189000 0.195624 0.197327 0.187165 0.227868 0.202625 0.173510 0.179693 0.217291 0.183266 0.185477 0.215500 0.211392 0.186778 0.186008 0.340114
chargesum: 0.00000
title: Mulliken charges with hydrogens summed into heavy atoms:
elementType: O N C C C C C C C C C C C
charge: -0.112335 -0.070453 0.147295 -0.045299 -0.025008 -0.002982 -0.007930 -0.000511 -0.001234 0.014362 0.005568 0.066135 0.032392
polarizability: 1.67599773e+02 -1.28934160e+00 1.15763399e+02 6.70271330e-01 1.78154089e+00 1.04323978e+02
1716.lowfreq: -3.9599 0.0004 0.0007 0.0009 4.9549 22.6330 34.1243 40.3726 48.7701
frequency: 30.8964 40.1741 48.0996 73.3339 95.5770 114.0493 128.3626 137.6310 185.6782 197.8166 223.1443 257.4660 281.7463 320.5344 376.9729 382.7854 431.4172 443.1982 472.6420 493.9624 568.5781 641.9151 743.4129 777.3196 780.9810 789.1170 840.9928 850.1470 877.9729 892.4431 917.8161 949.2880 963.5204 968.7415 991.5971 1029.9161 1043.9410 1050.4096 1058.4820 1069.0607 1074.3521 1080.1875 1112.6539 1115.8401 1143.8989 1149.6847 1174.7177 1189.4309 1205.6500 1225.7671 1244.9974 1249.2806 1254.9240 1259.9971 1273.9293 1283.1934 1287.8117 1300.7176 1303.7321 1317.8421 1328.6362 1333.8307 1338.4438 1340.6167 1353.2964 1360.3802 1378.1338 1413.3917 1451.6142 1457.7771 1461.5086 1462.9007 1465.7195 1468.8767 1469.9698 1476.4691 1477.0791 1488.0795 1493.8372 2852.7740 2924.6748 2944.5111 2949.9601 2952.7801 2961.5837 2962.6315 2962.8759 2964.6492 2966.4701 2971.7207 2990.3519 2992.1806 2997.0329 3021.7194 3023.9976 3027.6420 3036.2686 3040.2969 3045.5118 3059.7346 3414.1185 3563.9907
redmass: 4.2251 2.0857 3.5877 3.2526 1.8631 3.5759 2.6661 2.1023 2.6432 4.2264 1.8329 3.4406 1.0824 1.7823 3.6298 3.3537 3.1432 2.0745 2.0960 3.1868 2.2982 1.4257 1.0733 1.5271 1.1839 1.8754 2.0993 1.1978 1.7470 1.5093 1.9156 1.9306 2.8504 1.9166 3.0646 3.1906 1.7533 1.2427 2.0446 1.8301 2.0869 2.1423 2.3074 1.7891 3.8586 1.4005 1.7314 1.5379 1.2777 1.3775 1.3144 1.2632 1.2897 1.3713 1.1451 1.0980 1.1406 1.2120 1.3149 1.3341 1.3518 1.4181 1.4678 1.4893 1.4336 1.5668 1.4842 1.4447 1.2099 1.0965 1.0891 1.0893 1.0760 1.0710 1.0827 1.0910 1.0902 1.0889 1.0934 1.0704 1.0544 1.0756 1.0646 1.0591 1.0714 1.0636 1.0631 1.0628 1.0638 1.1064 1.0791 1.0664 1.0960 1.0964 1.0974 1.0999 1.1006 1.1013 1.0988 1.1044 1.0736 1.0664
irintensity: 0.0763 5.4716 1.3143 0.0390 3.3067 1.2054 0.2183 3.8843 1.9363 0.8092 0.4677 7.4796 157.7989 1.9014 3.4807 2.3975 1.3054 10.8370 0.7613 8.9367 1.9808 99.2814 9.1633 1.9993 0.8973 2.6725 6.1563 0.3192 8.0847 13.1583 0.3207 9.7797 24.5772 24.7587 35.1272 6.3918 2.8186 2.4294 14.0044 1.4900 0.8301 0.5090 6.6052 19.0431 59.8227 3.1268 1.8376 0.6001 16.7209 1.9696 14.6488 3.3284 2.5392 16.9779 1.7907 0.1834 2.6059 5.2416 0.2104 6.3552 1.4259 0.6506 0.4651 5.6861 5.5899 8.1984 1.2475 5.0845 21.5518 5.4814 5.3426 9.4419 1.7363 0.3800 24.5141 2.7825 3.9277 6.6486 8.0766 86.1136 61.6640 3.2319 16.5675 24.3175 49.8229 66.9992 3.3785 37.0648 55.1494 53.7944 14.8346 58.2329 14.9906 91.0067 78.3167 8.4366 68.9301 18.2938 90.9909 118.1108 2.0696 2.0708
temp: 298.150 k
press: 1.00000 atm
elementType: 8 7 6 6 6 6 6 6 6 6 6 6 6 1 1 1 1 1 1 1 1 1 1 1 1 1 1 1 1 1 1 1 1 1 1 1
symmnumber: 1
zpe: 857948.5 jmol-1
zpe.correction: 0.326775 hartree
zpe.thermalcorrener: 0.342179 hartree
zpe.thermalcorrenthalpy: 0.343123 hartree
zpe.thermalcorrgfe: 0.282721 hartree
zpe.sumelectzpe: -561.835342 hartree
zpe.sumelectthermal: -561.819939 hartree
zpe.sumelectthermalent: -561.818995 hartree
zpe.sumelectthermalfe: -561.879397 hartree
dipole: 0.4191 2.5177 0.1249
dipole: 2.5554
quadrupole: -79.8697 -85.4484 -80.8476
quadrupole: -12.0959 -4.5778 0.8749
quadrupole: 2.1855 -3.3932 1.2076 -12.0959 -4.5778 0.8749
hfenergy: -562.1621178 hartree
pointgroup: C01 [X(C11H23N1O1)]
dipole: 0.2150282 -0.5230561 -0.8312111 debye
polarizability: 167.291583|3.6918751|106.6591162|2.2654212|4.9379544|113.7364508 unknown
InChI: InChI=1S/C11H23NO/c13-10-6-2-5-9-12-11-7-3-1-4-8-11/h11-13H,1-10H2
charge 0 multiplicity 1
36 atoms
O  -6.758553 -0.183364 0.055808
N  0.667979 0.3631 0.689687
C  2.034319 0.513148 0.13116
C  3.005136 0.922568 1.263464
C  2.58172 -0.742091 -0.61404
C  4.445863 1.143229 0.743385
C  4.016718 -0.511693 -1.148336
C  4.977864 -0.101109 -0.008194
C  -0.429441 0.120599 -0.271255
C  -1.801699 0.222101 0.425378
C  -2.982996 -0.097607 -0.517784
C  -4.353384 0.017713 0.186899
C  -5.523579 -0.329665 -0.736366
H  1.990687 1.348244 -0.601706
H  3.013742 0.119377 2.032672
H  2.617283 1.834776 1.753647
H  1.905334 -1.016991 -1.446839
H  2.586567 -1.59687 0.096702
H  5.116283 1.39958 1.58667
H  4.453671 2.013501 0.054514
H  3.996627 0.292107 -1.913999
H  4.386985 -1.424242 -1.655233
H  5.990047 0.098291 -0.411132
H  5.07614 -0.944858 0.706269
H  0.653676 -0.322396 1.459787
H  -0.359631 0.894289 -1.062866
H  -0.363749 -0.86925 -0.790093
H  -1.826154 -0.47882 1.287119
H  -1.910452 1.239575 0.847378
H  -2.859405 -1.123394 -0.925414
H  -2.952812 0.590306 -1.389214
H  -4.497813 1.046645 0.569141
H  -4.38549 -0.657746 1.064056
H  -5.534345 0.35525 -1.613236
H  -5.416529 -1.372233 -1.11012
H  -7.541408 -0.396266 -0.512209
