program: Gaussian 09
title: 000244286
version: EM64L-G09RevD.01
frameworkgroup: C1[X(C9H16O3)]
method: RPBEPBE
basis: SDD
operation: Freq
keyword: #pfreq=noraman
keyword: PBEPBE/SDD
title: #p freq=noraman PBEPBE/SDD
converged: YES YES NO NO
title: Mulliken charges:
elementType: O O O C C C C C C C C C H H H H H H H H H H H H H H H H
charge: -0.312028 -0.444338 -0.241066 -0.008229 -0.109502 -0.448532 -0.430212 -0.399150 -0.396984 0.286454 -0.492515 -0.660258 0.257465 0.198256 0.241498 0.203905 0.225733 0.212691 0.204429 0.208161 0.195621 0.209736 0.342721 0.241869 0.236921 0.235645 0.216113 0.225595
chargesum: 0.00000
title: Mulliken charges with hydrogens summed into heavy atoms:
elementType: O O O C C C C C C C C C
charge: -0.312028 -0.101617 -0.241066 0.249235 0.088754 -0.003129 0.008213 0.013441 0.008373 0.286454 -0.013725 0.017096
polarizability: 1.30879913e+02 1.90218205e+00 9.67511702e+01 -2.91523180e-01 -2.77607513e+00 8.59885372e+01
1716.lowfreq: -21.4125 -12.3088 0.0002 0.0005 0.0008 7.5007 19.0091 56.8976 63.3961
frequency: -19.6810 56.8367 63.2884 81.6861 135.9561 177.4682 184.3988 215.0827 252.8498 303.9907 311.7896 372.1773 388.9801 413.8855 422.5552 449.6480 532.1760 546.7638 564.2015 640.4513 787.1884 791.9418 814.0209 837.3647 856.1001 886.0600 903.3747 943.1387 970.6891 1014.2880 1024.3969 1049.3704 1058.3458 1077.0062 1084.1259 1098.8134 1113.5499 1128.7668 1135.4620 1206.7864 1224.6074 1239.3892 1243.3161 1258.1157 1293.0436 1297.3018 1319.5797 1328.9323 1336.6836 1339.8346 1342.2936 1364.4136 1380.5487 1397.6428 1443.0803 1465.8144 1466.1939 1470.7810 1473.1178 1479.2461 1481.7477 1646.5888 2940.3502 2974.9411 2979.9251 2989.1461 2993.4998 2994.7207 2999.6463 3029.3860 3041.2159 3046.9703 3047.7617 3064.2094 3067.9724 3096.3645 3104.4093 3547.2071
redmass: 1.9982 5.1541 3.6826 3.2577 3.7672 2.0151 1.3042 5.3603 3.6442 3.6422 1.7662 2.6041 3.3814 1.4115 2.5171 3.1054 3.0734 2.7415 2.4977 4.2481 1.7664 1.4151 2.9530 1.8300 2.6729 2.1865 1.8679 2.2671 2.8183 1.9805 2.6793 1.3249 2.0929 2.4383 1.7248 1.6647 1.9821 2.7493 2.4049 1.4772 1.2816 1.2964 1.1797 1.2534 1.2820 1.2726 1.2648 1.4420 1.4097 1.6518 1.5388 1.4773 1.6846 1.2094 1.0847 1.0896 1.0885 1.0400 1.0822 1.0936 1.0512 9.5937 1.0832 1.0649 1.0625 1.0632 1.0613 1.0627 1.0375 1.0848 1.0957 1.1001 1.0969 1.1013 1.1015 1.1005 1.1002 1.0653
irintensity: 0.1948 3.3193 0.2095 1.1064 1.4797 0.6709 0.4504 3.7398 10.2384 12.7870 1.0599 3.3278 16.4052 119.6110 30.3094 8.2705 11.9077 2.8122 0.9241 2.9396 3.5943 13.5340 11.2818 12.9669 21.5353 7.1624 3.7054 4.0013 58.8160 82.5637 75.7787 17.7616 12.8443 91.8348 0.2610 11.1036 25.6706 263.5623 24.2532 1.6644 20.5569 0.9604 0.9593 13.0274 4.2533 1.8575 5.2614 27.7803 1.4634 32.7236 2.5618 10.3958 8.9477 19.2181 27.3874 10.5183 3.9581 13.3969 20.8184 5.6831 14.4669 150.5898 35.3034 35.4733 29.8883 21.2367 20.4257 19.1088 22.5031 17.7130 51.6730 50.4694 8.4506 16.3767 59.6300 31.4814 29.3436 4.0606
temp: 298.150 k
press: 1.00000 atm
elementType: 8 8 8 6 6 6 6 6 6 6 6 6 1 1 1 1 1 1 1 1 1 1 1 1 1 1 1 1
symmnumber: 1
zpe: 628667.4 jmol-1
zpe.correction: 0.239447 hartree
zpe.thermalcorrener: 0.251640 hartree
zpe.thermalcorrenthalpy: 0.252584 hartree
zpe.thermalcorrgfe: 0.200971 hartree
zpe.sumelectzpe: -577.270504 hartree
zpe.sumelectthermal: -577.258311 hartree
zpe.sumelectthermalent: -577.257367 hartree
zpe.sumelectthermalfe: -577.308980 hartree
dipole: 0.1515 -0.5926 -2.2944
dipole: 2.3745
quadrupole: -66.0996 -77.9183 -74.9594
quadrupole: 8.4907 -3.2190 0.3801
quadrupole: 6.8928 -4.9259 -1.9669 8.4907 -3.2190 0.3801
hfenergy: -577.5099512 hartree
pointgroup: C01 [X(C9H16O3)]
dipole: -0.0662968 0.3317879 -0.8707926 debye
polarizability: 130.4899423|3.9608603|96.3370501|0.9783943|4.0301962|86.792628 unknown
InChI: InChI=1S/C9H16O3/c1-2-9(11)12-8-6-4-3-5-7(8)10/h7-8,10H,2-6H2,1H3
charge 0 multiplicity 1
28 atoms
O  -0.816708 -0.289118 -0.593504
O  1.188696 -2.239145 0.035692
O  -2.052026 0.822418 1.048016
C  0.469428 0.135713 0.066741
C  1.517034 -0.880619 -0.413729
C  0.834674 1.575115 -0.330751
C  2.902304 -0.526749 0.151774
C  2.232061 1.93809 0.233361
C  3.304274 0.919158 -0.224738
C  -2.013691 0.142626 -0.001312
C  -3.206396 -0.318132 -0.825901
C  -4.547422 -0.124877 -0.094859
H  0.324958 0.052397 1.160803
H  1.542271 -0.840904 -1.526377
H  0.065885 2.27093 0.048758
H  0.846181 1.651689 -1.436276
H  3.63724 -1.259057 -0.228281
H  2.869328 -0.641357 1.25308
H  2.188904 1.953348 1.341395
H  2.506895 2.959545 -0.089987
H  3.433844 0.994558 -1.323947
H  4.282755 1.164397 0.229206
H  0.269675 -2.441994 -0.278154
H  -3.19179 0.256645 -1.773379
H  -3.046942 -1.373517 -1.114315
H  -4.681488 0.927353 0.207629
H  -5.387192 -0.412938 -0.751322
H  -4.594354 -0.740077 0.820278
