program: Gaussian 09
title: 000244316
version: EM64L-G09RevD.01
frameworkgroup: C1[X(C16H20N2O8)]
method: RPBEPBE
basis: SDD
operation: Freq
keyword: #p
keyword: freq=noraman
keyword: PBEPBE/SDD
title: #p freq=noraman PBEPBE/SDD
converged: YES YES NO NO
title: Mulliken charges:
elementType: O O O O O O O O N N C C C C C C C C C C C C C C C C H H H H H H H H H H H H H H H H H H H H
charge: -0.237200 -0.223322 -0.121684 -0.110868 -0.254080 -0.243651 -0.236877 -0.223898 -0.126132 -0.138917 -0.401774 -0.359856 -0.419655 -0.426169 -0.305915 -0.325527 0.139201 0.135924 0.068485 0.059897 0.265731 0.270236 -0.266066 -0.269029 -0.663588 -0.680088 0.270198 0.243483 0.242484 0.265699 0.297586 0.241378 0.301716 0.250196 0.304633 0.307497 0.236443 0.226781 0.242679 0.226687 0.215076 0.241764 0.250631 0.211151 0.239291 0.279445
chargesum: 0.00000
title: Mulliken charges with hydrogens summed into heavy atoms:
elementType: O O O O O O O O N N C C C C C C C C C C C C C C C C
charge: -0.237200 -0.223322 -0.121684 -0.110868 -0.254080 -0.243651 -0.236877 -0.223898 -0.126132 -0.138917 0.111907 0.148327 0.119308 0.125744 -0.001281 -0.018030 0.139201 0.135924 0.068485 0.059897 0.265731 0.270236 0.197158 0.200338 0.043884 0.049799
polarizability: 2.20166002e+02 1.89111379e+01 2.05455647e+02 6.34718363e+00 -3.59380198e+00 1.92287241e+02
1716.lowfreq: -10.0492 -7.3068 -0.0008 -0.0006 -0.0005 5.1341 18.3869 24.9798 28.5686
frequency: 18.0505 24.9370 28.4915 41.8055 46.7158 58.5371 63.0073 64.1330 70.9877 81.6277 88.7046 95.0100 109.9079 121.5262 160.3971 165.5459 180.6046 196.1587 213.5732 237.1821 256.3943 262.4080 265.4270 287.9801 308.5862 317.6163 318.3800 319.6711 327.8790 331.0459 397.0745 432.3026 437.8019 440.9897 467.0293 526.6470 546.2587 558.8599 583.7219 606.2801 628.4376 659.6833 670.2941 686.8606 691.4930 711.9846 720.9535 776.3649 778.3636 808.3808 812.2921 818.0005 821.5469 856.0543 859.9162 875.0664 900.5369 973.4091 985.0858 996.8802 1000.0949 1012.7281 1017.8797 1028.8348 1033.8724 1057.6656 1079.6354 1096.0939 1097.4953 1107.0623 1121.3376 1137.1034 1154.4079 1158.2720 1160.4174 1181.8882 1187.5930 1205.7057 1214.6957 1230.5049 1243.1928 1266.0658 1276.3218 1276.9281 1279.8389 1288.3177 1305.1242 1317.0341 1354.9680 1355.6510 1359.9973 1368.4418 1393.4126 1397.4190 1403.2508 1406.7505 1458.4221 1459.1219 1462.0830 1465.4126 1469.6285 1478.4163 1483.3095 1488.6768 1491.2603 1493.6191 1622.7082 1632.3731 1636.9623 1638.5023 1684.5766 1689.4626 2966.1352 2980.1594 2986.9133 2988.9087 2995.7256 2998.3450 3024.6698 3031.9344 3034.2638 3041.2072 3058.3998 3059.5721 3064.7268 3083.9973 3091.6085 3092.2121 3096.2514 3097.5103 3122.5784 3123.8635
redmass: 6.4312 5.2602 4.3162 4.4382 5.3438 5.5312 3.7944 5.0300 4.6495 8.7968 6.2205 6.2538 4.4896 5.5360 5.5383 4.7266 3.1035 1.9826 1.7903 1.6977 2.1616 2.8956 2.4045 3.8789 3.7115 3.9706 4.1625 4.2950 6.4027 6.9952 5.1911 3.6683 6.4341 4.9578 4.3971 5.8911 6.8352 7.2242 4.4314 3.9332 5.8751 5.9264 4.0961 5.6539 4.5746 5.9574 5.1987 2.7477 2.9138 2.1143 2.5969 2.0611 2.4484 2.9012 2.7338 3.0251 3.5705 2.2411 3.1374 2.3875 2.6021 3.2638 2.0250 2.7511 3.5036 2.7317 4.0039 2.1995 2.2040 3.2008 2.4835 2.8966 2.2532 1.7226 1.7252 1.3837 1.4351 1.5081 1.2204 1.7949 2.0684 1.9915 1.1379 1.1267 1.7224 1.9213 1.6497 1.8475 1.3041 1.3094 1.4300 1.3253 1.2268 1.2199 2.0106 1.8962 1.0872 1.0847 1.0564 1.0505 1.0817 1.0771 1.0537 1.1085 1.1072 1.0518 8.3937 8.9363 10.9605 10.0605 12.4942 12.8836 1.0642 1.0653 1.0641 1.0366 1.0363 1.0582 1.0837 1.0598 1.0605 1.0978 1.1045 1.0980 1.1012 1.0972 1.0982 1.0860 1.1021 1.1022 1.1060 1.1071
irintensity: 2.0493 1.1405 1.6549 1.9684 2.6714 1.6917 3.4863 4.4567 1.6499 0.7810 2.5294 0.0805 0.3816 0.2632 3.5627 4.3159 0.5842 3.2716 9.5082 0.2802 2.2472 0.6233 1.6772 4.1313 14.4747 5.0777 3.8848 13.1131 4.8743 9.8094 2.3280 5.4690 18.7957 9.1218 24.2306 5.2681 1.9667 1.6607 3.2467 1.1827 1.1035 2.3031 16.3173 16.6567 20.5628 1.4597 0.8539 7.7806 11.6624 3.8420 1.4313 9.1043 6.0356 11.4779 2.8886 5.2488 11.4646 0.8007 21.7306 38.8773 76.0480 42.3788 30.3767 2.5664 55.2009 32.7745 69.5562 29.2063 37.4964 1.6059 156.4264 254.1824 53.1517 45.3312 17.1398 39.7619 61.8565 19.5364 61.7374 28.2347 48.6757 66.7637 6.0925 5.7310 118.1058 75.1025 12.4074 65.8066 5.8556 8.0167 2.8322 10.8266 16.3857 23.2792 3.8188 7.6667 21.8449 25.2311 11.4219 13.7270 21.9090 24.2190 9.5181 1.6438 9.7169 18.1955 350.5073 42.8767 101.8585 337.6941 210.6164 129.4703 8.8666 68.7664 56.0992 14.1756 14.4686 24.1727 1.4192 32.9129 25.1375 0.3055 16.6530 6.7987 1.3176 25.9144 28.7739 0.6931 4.4411 3.6439 33.7433 20.5780
temp: 298.150 k
press: 1.00000 atm
elementType: 8 8 8 8 8 8 8 8 7 7 6 6 6 6 6 6 6 6 6 6 6 6 6 6 6 6 1 1 1 1 1 1 1 1 1 1 1 1 1 1 1 1 1 1 1 1
symmnumber: 1
zpe: 928663.3 jmol-1
zpe.correction: 0.353709 hartree
zpe.thermalcorrener: 0.380162 hartree
zpe.thermalcorrenthalpy: 0.381106 hartree
zpe.thermalcorrgfe: 0.294005 hartree
zpe.sumelectzpe: -1331.041760 hartree
zpe.sumelectthermal: -1331.015308 hartree
zpe.sumelectthermalent: -1331.014363 hartree
zpe.sumelectthermalfe: -1331.101464 hartree
dipole: 0.6664 -2.1714 0.1281
dipole: 2.2750
quadrupole: -128.5181 -140.0730 -176.8041
quadrupole: 18.2632 -19.5285 21.7428
quadrupole: 19.9469 8.3921 -28.3391 18.2632 -19.5285 21.7428
hfenergy: -1331.3954695 hartree
pointgroup: C01 [X(C16H20N2O8)]
dipole: 0.737408 -0.319665 -0.3938992 debye
polarizability: 188.8580909|-5.7370551|196.9212644|4.9721191|-4.2653044|232.1295351 unknown
InChI: InChI=1S/C16H20N2O8/c1-3-25-15(23)9-7-17(13(21)11(9)19)5-6-18-8-10(12(20)14(18)22)16(24)26-4-2/h9-10H,3-8H2,1-2H3
charge 0 multiplicity 1
46 atoms
O  0.127963 -2.812208 -2.409954
O  -0.945107 3.215534 -2.30946
O  1.581609 -2.695632 0.242561
O  -3.271904 2.648916 -0.441995
O  3.342042 -0.217198 1.5521
O  -3.04068 -0.349451 1.08464
O  1.448655 1.065362 1.061529
O  -1.03789 -0.754244 -0.039567
N  1.091122 -0.660159 -2.608684
N  -1.379749 0.962525 -2.905176
C  0.525318 -0.36322 -3.924091
C  -0.379132 0.896173 -3.971756
C  1.847524 0.328525 -1.80771
C  -2.305614 -0.146328 -2.564726
C  2.403179 -0.484142 -0.613746
C  -2.94079 0.287808 -1.220605
C  0.834353 -1.864464 -1.968977
C  -1.572681 2.13052 -2.176009
C  1.591254 -1.813942 -0.630909
C  -2.694367 1.821494 -1.167108
C  2.316821 0.226892 0.728121
C  -2.219199 -0.341249 -0.021729
C  3.32555 0.26322 2.972321
C  -2.409623 -0.780225 2.382723
C  2.446462 -0.649789 3.829997
C  -1.658648 0.389994 3.021695
H  -0.030398 -1.269361 -4.226684
H  1.337247 -0.207395 -4.663289
H  -0.867655 0.913936 -4.968215
H  0.214746 1.824432 -3.883532
H  1.182248 1.133241 -1.444569
H  2.653131 0.779986 -2.414599
H  -1.75515 -1.097661 -2.474196
H  -3.08214 -0.255505 -3.346712
H  3.457782 -0.774363 -0.777784
H  -4.017944 0.078991 -1.135089
H  2.966919 1.307478 2.984121
H  4.385235 0.219102 3.269097
H  -1.742055 -1.634632 2.174042
H  -3.274104 -1.104989 2.982069
H  2.518289 -0.343948 4.890312
H  2.772897 -1.69992 3.745594
H  1.390222 -0.5830 3.520167
H  -1.283271 0.081473 4.015782
H  -2.328126 1.255796 3.16151
H  -0.796445 0.699623 2.40659
