program: Gaussian 09
title: 000244270
version: EM64L-G09RevD.01
frameworkgroup: C1[X(C10H13NO3)]
method: RPBEPBE
basis: SDD
operation: Freq
keyword: #p
keyword: freq=noraman
keyword: PBEPBE/SDD
title: #p freq=noraman PBEPBE/SDD
converged: YES YES NO NO
title: Mulliken charges:
elementType: O O O N C C C C C C C C C C H H H H H H H H H H H H H
charge: -0.216519 -0.228824 -0.183724 0.018815 -0.377871 -0.342551 -0.305937 -0.684919 0.296168 0.206808 -0.319298 -0.331157 -0.232205 -0.225685 0.220194 0.219267 0.192489 0.193361 0.211946 0.212134 0.215049 0.215299 0.218134 0.261774 0.291372 0.234873 0.241004
chargesum: 0.00000
title: Mulliken charges with hydrogens summed into heavy atoms:
elementType: O O O N C C C C C C C C C C
charge: -0.216519 -0.228824 -0.183724 0.018815 0.061591 0.043300 0.118143 -0.036437 0.296168 0.206808 -0.057524 -0.039785 0.002668 0.015319
polarizability: 1.80180957e+02 -3.47094268e+00 1.49090448e+02 -5.28077868e-02 -1.53862770e-03 6.80144890e+01
1716.lowfreq: -30.7944 -8.3379 -0.0009 -0.0005 0.0004 6.6005 8.8880 42.5194 59.7367
frequency: -30.7915 42.3913 59.6239 64.8379 108.0605 129.4584 160.7271 183.4979 221.6728 234.2791 254.2384 291.8961 361.8395 404.4753 430.7685 440.8104 523.7699 547.3177 592.6832 646.1913 663.5540 730.4656 743.7424 759.9631 768.5618 808.6774 816.7606 857.1070 904.8582 940.4274 944.4879 966.7586 991.8066 1038.3535 1043.4550 1061.1127 1083.7833 1123.8633 1140.4077 1146.6465 1172.3540 1192.8587 1213.4503 1236.7072 1267.7750 1275.6237 1283.7105 1287.7277 1346.2954 1359.9697 1373.0840 1389.4651 1396.5914 1439.6615 1464.2271 1470.2931 1475.1506 1478.9769 1483.3116 1490.8111 1578.1844 1609.2741 2956.2706 2966.5956 2979.4131 3004.1964 3010.8788 3019.6218 3068.3555 3079.0692 3079.7053 3141.5088 3163.7170 3175.8049 3187.6722
redmass: 14.8681 4.1486 1.6313 4.2503 3.0402 4.4600 2.0412 4.6506 4.2701 1.1342 5.4056 6.9395 5.6090 5.0883 3.6647 4.3266 3.4828 6.4418 6.2588 7.6956 4.6889 4.4846 1.0791 8.6123 1.3555 7.1840 1.1451 1.4314 1.8034 1.1580 7.4099 1.3491 1.3249 3.2110 3.1518 2.9398 2.1971 2.6220 1.4286 1.6810 1.1990 5.3293 1.3761 3.2321 1.6261 1.3331 1.1746 1.0653 1.4629 7.3747 1.9906 2.6443 1.2408 2.7635 1.4610 1.1217 1.2219 1.0413 1.2188 1.1206 6.9018 6.5080 1.0551 1.0589 1.0361 1.0597 1.1008 1.1071 1.1039 1.0996 1.1021 1.0872 1.0907 1.0944 1.0976
irintensity: 0.0028 0.1584 0.0611 1.0416 0.7913 1.1577 1.9702 0.4880 1.9170 0.0470 0.7103 0.2776 0.7259 0.6366 0.3468 2.3299 6.3355 1.4383 8.5361 10.8489 12.0324 17.4635 14.5341 12.0421 72.9129 16.2894 1.9556 0.0367 19.9575 0.9458 73.0902 2.6084 0.8405 23.2462 0.9279 30.5285 5.7962 3.3146 2.1385 26.2363 85.4697 297.5590 0.0087 124.1665 35.0122 13.4142 0.3275 0.0065 0.1595 104.2525 3.6762 40.5696 4.3602 11.8521 103.3973 10.3164 47.3202 13.2958 8.3676 16.7366 44.7436 81.4003 20.5996 46.6146 33.5856 24.0637 17.3975 14.0266 3.9792 47.8867 102.7733 5.6509 14.0441 5.1779 10.4729
temp: 298.150 k
press: 1.00000 atm
elementType: 8 8 8 7 6 6 6 6 6 6 6 6 6 6 1 1 1 1 1 1 1 1 1 1 1 1 1
symmnumber: 1
zpe: 564348.2 jmol-1
zpe.correction: 0.214949 hartree
zpe.thermalcorrener: 0.228042 hartree
zpe.thermalcorrenthalpy: 0.228986 hartree
zpe.thermalcorrgfe: 0.174206 hartree
zpe.sumelectzpe: -668.128842 hartree
zpe.sumelectthermal: -668.115749 hartree
zpe.sumelectthermalent: -668.114804 hartree
zpe.sumelectthermalfe: -668.169584 hartree
dipole: -2.3953 -6.3360 -0.0029
dipole: 6.7736
quadrupole: -74.3504 -88.3686 -83.7091
quadrupole: -9.0302 0.0329 0.0064
quadrupole: 7.7923 -6.2259 -1.5664 -9.0302 0.0329 0.0064
hfenergy: -668.3437904 hartree
pointgroup: C01 [X(C10H13N1O3)]
dipole: 0.6523727 2.5646503 0.3145462 debye
polarizability: 180.4920365|-0.1947995|147.6211396|2.8255949|9.2985273|69.1727176 unknown
InChI: InChI=1S/C10H13NO3/c1-2-3-8-14-10-7-5-4-6-9(10)11(12)13/h4-7H,2-3,8H2,1H3
charge 0 multiplicity 1
27 atoms
O  0.620534 -0.167752 0.069716
O  -2.653368 -2.803661 -0.329141
O  -0.392309 -2.572295 -0.239918
N  -1.58148 -2.078428 -0.213523
C  3.028042 -0.016906 0.148893
C  4.284015 0.878768 0.265019
C  1.73817 0.801757 0.205942
C  5.590291 0.057089 0.219856
C  -0.678832 0.305088 0.090218
C  -1.769595 -0.617283 -0.045428
C  -0.994875 1.685924 0.241824
C  -3.108197 -0.155809 -0.025012
C  -2.329623 2.129591 0.260433
C  -3.396797 1.210225 0.127348
H  3.051929 -0.583723 -0.80063
H  3.016295 -0.762537 0.965771
H  4.244214 1.455957 1.2116
H  4.28789 1.622912 -0.557574
H  1.644588 1.338091 1.172644
H  1.689245 1.536352 -0.624024
H  5.626138 -0.674655 1.048167
H  5.671267 -0.505879 -0.728482
H  6.478508 0.70898 0.304301
H  -0.189667 2.417328 0.345657
H  -3.899033 -0.902532 -0.132573
H  -2.536294 3.198768 0.37954
H  -4.434856 1.55453 0.141679
