program: Gaussian 09
title: 000244276
version: EM64L-G09RevD.01
frameworkgroup: C1[X(C11H20Br2N2O2)]
method: RPBEPBE
basis: SDD
operation: Freq
keyword: #p
keyword: freq=noraman
keyword: PBEPBE/SDD
title: #p freq=noraman PBEPBE/SDD
converged: YES YES NO NO
title: Mulliken charges:
elementType: Br Br O O N N C C C C C C C C C C C H H H H H H H H H H H H H H H H H H H H
charge: -0.033000 -0.060184 -0.273261 -0.267930 -0.373339 -0.326978 -0.348242 -0.400397 -0.375107 -0.377908 -0.409076 0.245539 0.216086 -0.464056 -0.468745 -0.655364 -0.665202 0.196927 0.215122 0.215978 0.205321 0.232987 0.209099 0.249882 0.224510 0.251240 0.215415 0.303644 0.289095 0.231404 0.264396 0.263516 0.265693 0.282949 0.314889 0.302962 0.302133
chargesum: 0.00000
title: Mulliken charges with hydrogens summed into heavy atoms:
elementType: Br Br O O N N C C C C C C C C C C C
charge: -0.033000 -0.060184 -0.273261 -0.267930 -0.069695 -0.037883 0.063808 0.020902 0.066980 0.096483 0.057579 0.245539 0.216086 0.031745 0.060464 -0.057526 -0.060107
polarizability: 2.12948677e+02 -9.40344784e+00 1.68462337e+02 1.07268768e+01 1.61772991e-01 1.26684632e+02
1716.lowfreq: -9.7864 -1.3805 -0.0007 -0.0006 -0.0003 4.3988 11.9294 14.4715 22.6532
frequency: 11.6910 14.2582 22.0254 26.3749 39.4270 43.2261 55.5511 66.3018 68.7500 88.1375 104.3749 130.4133 183.2115 188.8113 191.5629 203.7604 226.3564 244.1128 286.9623 314.2471 334.8225 405.8290 440.6614 461.3835 497.7440 508.4829 551.6580 571.0099 580.6267 603.6390 625.8580 656.6817 717.9433 728.6285 772.9728 791.7403 798.4204 837.5129 871.4537 898.8886 911.0483 929.9690 935.0142 959.5233 991.0264 1029.2729 1050.3564 1064.1249 1084.9196 1098.2545 1105.6836 1112.0585 1126.8583 1127.6429 1178.7229 1188.0677 1202.3549 1215.5657 1235.4188 1254.9478 1264.3587 1270.6616 1281.2096 1285.7225 1296.6934 1310.0589 1323.2372 1325.8556 1339.7271 1346.2899 1361.5002 1368.8721 1425.6280 1444.2046 1445.9220 1446.5010 1454.1198 1458.7991 1465.7570 1467.6358 1475.8381 1499.3914 1506.4554 1612.5899 1614.8754 2968.9149 2976.5094 2986.0250 2989.7306 2994.1912 2998.8601 3002.6150 3016.3096 3043.1582 3045.9489 3046.5066 3058.1249 3065.3472 3069.4065 3072.9355 3073.5850 3148.8931 3163.2775 3493.3628 3516.0942
redmass: 12.8591 11.1854 6.2523 7.6476 3.7925 4.5601 4.4902 3.2885 4.2031 3.2480 4.3924 2.7333 5.1025 3.4973 3.0493 4.4936 3.0665 3.4826 2.2937 3.0994 2.3657 3.5228 2.2828 2.7513 3.0431 2.8264 3.7349 4.1657 2.8111 1.4051 1.2632 2.6057 3.4209 1.3783 1.2906 2.2969 2.0221 1.9565 2.2802 2.7438 2.7589 1.7729 2.0927 1.4803 2.1072 2.4693 2.9424 2.6190 2.5365 2.0719 2.1573 2.4977 1.7010 1.2265 1.2988 1.3248 1.2063 1.3638 1.4772 1.2110 1.5320 1.1955 1.2123 1.3752 1.1333 1.2527 1.5099 1.5462 1.3373 1.3957 1.4072 1.3218 1.0753 1.1124 1.0935 1.1042 1.0997 1.1060 1.0952 1.0891 1.1073 1.7139 1.8008 6.2615 6.7340 1.0619 1.0609 1.0636 1.0640 1.0606 1.0593 1.0622 1.0967 1.1019 1.0954 1.0989 1.1012 1.0608 1.0978 1.0583 1.1040 1.1116 1.1106 1.0790 1.0779
irintensity: 0.2724 0.5304 0.8553 4.9013 0.9670 2.1119 12.9253 0.7752 2.1575 5.5337 5.9362 2.7197 2.5084 0.8668 11.1597 1.1574 2.3967 5.6097 12.2580 1.3473 4.4339 4.8792 11.8898 2.2017 26.1455 7.0183 14.0273 63.2874 45.6407 128.2400 34.6271 2.7579 14.0007 7.0221 10.1323 0.1561 9.0168 11.8698 6.7449 3.5513 17.9937 1.5678 5.2287 4.8400 3.1576 2.2950 16.4545 5.7339 6.2976 4.2983 3.1349 0.9125 5.7019 1.4266 0.5457 15.2313 6.6810 73.0739 37.1139 17.4806 9.9942 58.2308 3.9864 14.5806 13.3465 2.5375 78.5707 16.9896 2.9586 10.1242 0.2069 3.6475 39.3675 7.7308 0.8526 34.6890 15.6289 26.7033 5.6505 32.2362 39.0809 153.7909 143.8193 286.1249 135.2980 9.9436 28.4581 26.7367 66.3032 2.5700 22.7506 28.6602 3.5424 72.4455 4.2663 43.5923 15.9411 17.0991 15.4686 9.6470 17.1774 4.2788 4.0641 84.5030 53.9932
temp: 298.150 k
press: 1.00000 atm
elementType: 35 35 8 8 7 7 6 6 6 6 6 6 6 6 6 6 6 1 1 1 1 1 1 1 1 1 1 1 1 1 1 1 1 1 1 1 1
symmnumber: 1
zpe: 800230.2 jmol-1
zpe.correction: 0.304792 hartree
zpe.thermalcorrener: 0.325691 hartree
zpe.thermalcorrenthalpy: 0.326635 hartree
zpe.thermalcorrgfe: 0.247317 hartree
zpe.sumelectzpe: -716.712279 hartree
zpe.sumelectthermal: -716.691379 hartree
zpe.sumelectthermalent: -716.690435 hartree
zpe.sumelectthermalfe: -716.769753 hartree
dipole: -2.6722 -2.3109 -1.2918
dipole: 3.7616
quadrupole: -159.2030 -122.7401 -116.0223
quadrupole: 3.1956 -1.3965 1.2073
quadrupole: -26.5479 9.9150 16.6329 3.1956 -1.3965 1.2073
hfenergy: -717.0170701 hartree
pointgroup: C01 [X(C11H20Br2N2O2)]
dipole: 1.1068727 -0.7651523 0.6160456 debye
polarizability: 200.079345|13.1276305|171.8168432|27.0189406|11.724929|136.1994572 unknown
InChI: InChI=1S/C11H20Br2N2O2/c12-6-4-10(16)14-8-2-1-3-9-15-11(17)5-7-13/h14-15H,1-9H2
charge 0 multiplicity 1
37 atoms
Br -5.263822 -2.163304 -2.25579
Br 0.34975 -2.67973 -0.31669
O  -3.351775 1.839102 -0.379318
O  4.416481 0.180541 0.293927
N  -1.683476 0.572099 0.649709
N  2.410489 0.011161 -0.870655
C  0.605591 2.493298 -0.341998
C  0.387619 1.927873 1.082259
C  2.09677 2.537125 -0.773833
C  -1.099819 1.683257 1.425715
C  2.575449 1.299545 -1.574958
C  -2.757079 0.729768 -0.207614
C  3.349819 -0.454618 0.025227
C  -3.177232 -0.543147 -0.96973
C  3.044191 -1.794677 0.724898
C  -4.702972 -0.591695 -1.098814
C  2.38314 -2.908519 -0.089717
H  0.021312 1.895056 -1.071531
H  0.174042 3.512391 -0.378911
H  0.802944 2.638369 1.824598
H  0.956712 0.985128 1.207824
H  2.749166 2.660088 0.111611
H  2.276608 3.418796 -1.420223
H  -1.709774 2.574895 1.196094
H  -1.20792 1.467821 2.507128
H  3.649048 1.413646 -1.808425
H  2.016131 1.231394 -2.526939
H  -1.248929 -0.350866 0.733586
H  1.541328 -0.514417 -1.000019
H  -2.800606 -1.45831 -0.476749
H  -2.727922 -0.50264 -1.980285
H  2.469839 -1.597791 1.65081
H  4.03058 -2.174905 1.056258
H  -5.209066 -0.751212 -0.135548
H  -5.096013 0.304797 -1.596632
H  2.75457 -2.975348 -1.123306
H  2.453427 -3.883568 0.414041
