program: Gaussian 09
title: 000244217
version: EM64L-G09RevD.01
frameworkgroup: C1[X(C15H9Cl5O)]
method: RPBEPBE
basis: SDD
operation: Freq
keyword: #p
keyword: freq=noraman
keyword: PBEPBE/SDD
title: #p freq=noraman PBEPBE/SDD
converged: YES YES NO NO
title: Mulliken charges:
elementType: Cl Cl Cl Cl Cl O C C C C C C C C C C C C C C C H H H H H H H H H
charge: 0.007143 0.044963 0.112520 -0.040899 -0.025958 -0.148831 -0.649267 -0.555349 0.641372 0.326915 0.347602 -0.417974 -0.323171 -0.337175 -0.347156 -0.202585 -0.209093 -0.112069 -0.208655 -0.223837 -0.110517 0.337921 0.235419 0.270890 0.281099 0.257697 0.260194 0.259926 0.266271 0.262604
chargesum: 0.00000
title: Mulliken charges with hydrogens summed into heavy atoms:
elementType: Cl Cl Cl Cl Cl O C C C C C C C C C C C C C C C
charge: 0.007143 0.044963 0.112520 -0.040899 -0.025958 -0.148831 -0.311347 -0.555349 0.641372 0.326915 0.347602 -0.182556 -0.052281 -0.056076 -0.089458 0.057609 0.050833 -0.112069 0.057616 0.038768 -0.110517
polarizability: 3.12098697e+02 -1.67515334e+01 2.07484684e+02 -2.07902345e+01 -2.95685511e+01 1.41980503e+02
1716.lowfreq: -7.6110 -2.2487 -0.0015 -0.0010 0.0006 4.4560 19.6128 25.0109 41.8377
frequency: 19.5099 24.9629 41.8262 54.0825 62.5792 77.6966 104.3426 126.7940 131.0563 145.8745 159.9982 171.8729 199.2806 222.4449 247.1667 255.2546 289.5854 302.3757 313.4135 331.1247 344.4698 398.7119 407.7418 410.6266 433.5823 470.5082 491.6214 536.5308 582.1773 607.5264 624.9720 625.2898 662.5642 679.6040 688.5758 719.2854 729.6591 767.8084 779.3806 818.9919 828.1211 834.8758 845.0007 857.8103 947.8302 965.6879 968.6088 983.8524 989.8981 1000.5004 1007.9924 1041.3613 1075.9437 1077.6601 1112.8656 1119.9735 1185.3143 1190.1798 1194.1783 1218.3446 1223.8609 1284.8300 1299.5775 1308.8909 1365.3674 1383.8839 1398.0204 1400.8568 1471.5063 1477.4073 1564.2423 1584.2419 1586.0647 1598.6606 1605.3321 3088.0543 3136.4453 3154.6225 3162.3012 3164.0210 3174.6442 3175.2005 3181.2211 3183.5604
redmass: 9.9173 9.1531 10.2188 5.3554 5.9288 14.6297 10.4111 15.0665 16.3996 11.3390 14.3280 11.7678 18.7850 13.5847 14.8430 8.8407 8.1221 7.4988 8.9989 10.4371 7.4136 7.0954 2.9124 3.2162 10.2057 4.2693 3.6532 6.2032 6.5212 6.4827 7.1829 6.4582 6.9972 6.7853 6.3533 4.4818 4.0440 4.3976 5.2758 1.9723 1.4338 1.2935 1.7794 2.3273 1.4008 1.3774 1.3882 1.4042 5.4792 4.2072 3.8987 7.7795 2.7105 2.7593 1.3775 1.3599 1.1879 1.1244 1.1757 3.6781 2.0769 1.5067 1.2552 1.4480 4.8683 5.4163 2.7203 3.8880 2.2798 2.4213 8.1296 7.2741 7.2068 6.2955 8.9632 1.0847 1.0900 1.0888 1.0888 1.0889 1.0957 1.0964 1.0978 1.0973
irintensity: 0.0570 0.0523 0.3138 0.4146 0.2410 0.8113 2.1946 1.3297 0.8839 2.8737 2.3024 1.9747 1.0659 2.3591 0.6553 1.7929 1.1453 0.0395 0.4652 1.2287 1.5087 8.0071 0.8160 2.9198 42.9115 19.7439 2.7000 14.9523 90.5017 30.8408 5.8630 14.6572 18.1270 15.9261 18.6263 15.5876 24.4090 21.0945 66.9409 32.3319 13.1818 10.4197 20.6384 75.6647 1.9445 6.3016 0.3084 2.1218 63.5555 28.3504 18.5879 12.6839 64.7007 67.1696 12.6879 7.5251 5.5978 9.3293 36.7193 185.6184 8.6082 9.5502 1.5372 2.6023 3.0913 0.2351 16.0231 16.2434 29.7214 55.2950 55.4497 5.3261 156.8033 67.8121 36.7845 0.5944 8.4809 0.6105 0.1794 1.4398 2.1418 1.9165 2.2416 0.2587
temp: 298.150 k
press: 1.00000 atm
elementType: 17 17 17 17 17 8 6 6 6 6 6 6 6 6 6 6 6 6 6 6 6 1 1 1 1 1 1 1 1 1
symmnumber: 1
zpe: 511282.0 jmol-1
zpe.correction: 0.194737 hartree
zpe.thermalcorrener: 0.214818 hartree
zpe.thermalcorrenthalpy: 0.215762 hartree
zpe.thermalcorrgfe: 0.142775 hartree
zpe.sumelectzpe: -2951.026002 hartree
zpe.sumelectthermal: -2951.005921 hartree
zpe.sumelectthermalent: -2951.004977 hartree
zpe.sumelectthermalfe: -2951.077964 hartree
dipole: 0.9746 -2.7601 -0.0069
dipole: 2.9271
quadrupole: -160.1535 -160.3941 -158.0388
quadrupole: -3.0029 -0.2517 -8.9663
quadrupole: -0.6247 -0.8653 1.4900 -3.0029 -0.2517 -8.9663
hfenergy: -2951.2207388 hartree
pointgroup: C01 [X(C15H9Cl5O1)]
dipole: -0.3571336 -1.0757914 -0.2033295 debye
polarizability: 305.9841431|29.0767685|193.8503248|-30.8940339|37.6018619|161.7294166 unknown
InChI: InChI=1S/C15H9Cl5O/c16-11-5-1-9(2-6-11)13(18)15(19,20)14(21)10-3-7-12(17)8-4-10/h1-8,13H
charge 0 multiplicity 1
30 atoms
Cl 0.407428 0.248703 2.334759
Cl 0.137334 1.183911 -2.068826
Cl 1.126454 2.891065 0.220966
Cl 6.485216 -1.428774 -0.926958
Cl -5.802325 -2.589588 0.233626
O  -1.719343 2.821741 0.637693
C  0.696928 0.10474 0.447958
C  0.102487 1.399687 -0.164045
C  2.134377 -0.244667 0.14476
C  -1.397629 1.680755 0.228688
C  -2.417642 0.576912 0.164684
C  2.38989 -1.286857 -0.782792
C  3.22968 0.41494 0.757965
C  -3.53493 0.724553 1.035655
C  -2.367578 -0.5538 -0.696739
C  3.710948 -1.650193 -1.122311
C  4.554728 0.058694 0.434973
C  4.775718 -0.965595 -0.507423
C  -4.564385 -0.232878 1.067978
C  -3.399348 -1.515506 -0.681533
C  -4.479564 -1.346483 0.206582
H  0.034414 -0.725914 0.162861
H  1.556256 -1.818644 -1.255211
H  3.048296 1.1928 1.504015
H  -3.577586 1.602119 1.687492
H  -1.561508 -0.666283 -1.427265
H  3.905443 -2.449644 -1.842348
H  5.399982 0.564055 0.910217
H  -5.413806 -0.119815 1.747117
H  -3.368534 -2.375029 -1.356836
