program: Gaussian 09
title: 000244187
version: EM64L-G09RevD.01
frameworkgroup: C1[X(C11H19N)]
method: RPBEPBE
basis: SDD
operation: Freq
keyword: #pfreq=noraman
keyword: PBEPBE/SDD
title: #p freq=noraman PBEPBE/SDD
converged: YES YES NO NO
title: Mulliken charges:
elementType: N C C C C C C C C C C C H H H H H H H H H H H H H H H H H H H
charge: -0.077762 0.240659 -0.605331 0.119354 0.034948 -0.731421 -0.736870 0.272801 -0.494759 -0.794777 -0.842553 -0.684037 0.234912 0.229100 0.202687 0.221721 0.233386 0.220579 0.201340 0.230887 0.232135 0.204205 0.229322 0.224637 0.256045 0.263626 0.224779 0.233075 0.224176 0.219949 0.213189
chargesum: 0.00000
title: Mulliken charges with hydrogens summed into heavy atoms:
elementType: N C C C C C C C C C C C
charge: -0.077762 0.240659 -0.141319 0.119354 0.034948 -0.073627 -0.084065 0.272801 -0.058420 -0.084773 -0.121073 -0.026723
polarizability: 1.71768199e+02 4.84417493e+00 1.24433094e+02 -2.44051392e+00 1.19666219e+00 9.46932721e+01
1716.lowfreq: -15.7876 -10.9216 -8.2772 0.0004 0.0005 0.0006 21.5996 60.4178 83.1009
frequency: 20.9191 60.2446 82.9722 110.7633 123.1830 184.6905 206.6137 219.1420 229.7574 263.0051 270.5617 277.6518 298.0390 316.1769 333.2276 359.9393 384.7272 452.9506 506.9807 523.8931 578.3315 594.0778 646.8225 684.4678 782.7923 807.2140 856.6300 869.5174 899.5547 936.3725 960.4842 982.8329 995.7189 1003.0766 1005.3725 1017.6022 1040.5155 1059.2403 1074.7669 1106.4985 1131.2485 1168.1142 1205.4877 1232.2578 1248.8291 1258.7047 1282.7741 1307.2805 1324.6741 1367.8893 1381.1687 1384.9802 1386.3803 1394.7565 1451.1040 1452.1916 1456.3099 1458.1974 1466.5846 1469.9501 1472.4596 1474.0752 1479.4484 1485.3720 1486.3063 1490.0373 1556.1651 1663.4937 2961.8264 2976.1813 2977.3126 2977.7738 2979.6466 2981.9999 2982.5737 3023.5220 3036.8517 3042.5540 3065.9578 3073.1782 3076.0264 3078.0792 3081.0416 3085.3916 3090.1935 3107.4586 3140.7353
redmass: 2.6908 2.5535 2.5070 1.1589 2.7923 1.4346 2.1318 1.1005 1.4562 1.2474 1.1531 1.8779 2.8351 2.8061 2.1249 2.6306 2.3856 2.7425 2.9681 2.8908 3.1582 3.7297 3.4675 3.8504 1.1883 5.4606 2.2133 2.2965 1.8400 1.3747 1.8642 1.8836 1.6703 1.3819 1.5442 2.0474 1.5725 2.3977 2.0468 1.4247 1.9631 2.1824 2.6680 2.5326 1.9908 1.4121 1.8795 1.4731 3.8998 1.2139 1.2357 1.2388 1.2218 1.2425 1.0649 1.0964 1.0764 1.0599 1.0496 1.0598 1.0469 1.0545 1.0566 1.0726 1.0532 1.0910 6.1248 7.9305 1.0435 1.0356 1.0505 1.0493 1.0441 1.0461 1.0411 1.0951 1.0993 1.0987 1.0971 1.1003 1.0998 1.0995 1.1010 1.1000 1.0993 1.0986 1.0913
irintensity: 0.1676 0.0699 0.0619 0.2263 1.7754 0.2667 1.8367 0.0034 0.4347 0.5732 1.0411 0.5815 0.5539 0.5584 2.9280 1.4410 1.7005 1.8577 2.5268 2.6941 4.6695 1.2356 2.0501 2.2644 4.1884 7.2530 1.3206 4.9122 1.0232 0.6471 2.6983 2.6895 11.3911 0.2931 4.5198 3.5968 4.6529 7.5192 6.0219 1.5709 8.2359 21.9142 0.8465 0.6914 7.9566 5.2684 37.4466 3.5315 44.4458 20.9621 8.2682 17.1911 17.1110 26.9410 14.0322 8.7837 12.5016 9.8826 3.7580 6.0647 10.6196 10.6349 18.4295 4.6639 8.6983 13.9356 43.5027 19.6289 40.4210 30.3394 29.9138 37.5211 34.2528 60.2079 0.9905 23.0233 13.3628 11.7975 17.0115 18.8990 44.3518 58.6544 55.3609 7.2703 47.5931 19.0850 13.2429
temp: 298.150 k
press: 1.00000 atm
elementType: 7 6 6 6 6 6 6 6 6 6 6 6 1 1 1 1 1 1 1 1 1 1 1 1 1 1 1 1 1 1 1
symmnumber: 1
zpe: 716574.3 jmol-1
zpe.correction: 0.272929 hartree
zpe.thermalcorrener: 0.287329 hartree
zpe.thermalcorrenthalpy: 0.288273 hartree
zpe.thermalcorrgfe: 0.231889 hartree
zpe.sumelectzpe: -484.352530 hartree
zpe.sumelectthermal: -484.338130 hartree
zpe.sumelectthermalent: -484.337185 hartree
zpe.sumelectthermalfe: -484.393570 hartree
dipole: 2.5697 -1.0466 -0.3370
dipole: 2.7950
quadrupole: -76.1332 -72.8969 -76.0110
quadrupole: 4.4939 0.2489 0.3511
quadrupole: -1.1195 2.1168 -0.9973 4.4939 0.2489 0.3511
hfenergy: -484.6254587 hartree
pointgroup: C01 [X(C11H19N1)]
dipole: 1.0175763 -0.3822703 -0.1661749 debye
polarizability: 171.3548254|6.1385975|124.6176772|-3.9983658|1.8513447|94.9220626 unknown
InChI: InChI=1S/C11H19N/c1-6-8(2)10-7-11(4,5)12-9(10)3/h6-7H2,1-5H3
charge 0 multiplicity 1
31 atoms
N  -1.83165 0.887759 0.27697
C  -1.922187 -0.601139 0.05431
C  -0.480336 -1.055889 -0.3649
C  0.391561 0.189557 -0.149511
C  -0.572665 1.28231 0.187358
C  -2.363302 -1.2446 1.39238
C  -2.9752 -0.864789 -1.044134
C  1.759268 0.20474 -0.283093
C  2.508314 -1.075497 -0.650419
C  -0.259474 2.746001 0.405325
C  2.671599 1.401224 -0.077692
C  3.033276 -1.836587 0.59975
H  -0.465345 -1.368147 -1.427721
H  -0.135908 -1.919581 0.232097
H  -2.511822 -2.333707 1.26987
H  -1.601758 -1.079069 2.176317
H  -3.311236 -0.79488 1.736515
H  -2.684884 -0.373703 -1.990589
H  -3.081159 -1.949998 -1.229923
H  -3.956431 -0.461144 -0.738138
H  1.86173 -1.753418 -1.236571
H  3.372326 -0.818423 -1.296108
H  0.297136 3.177179 -0.446138
H  0.347441 2.899462 1.317238
H  -1.2083 3.292413 0.526611
H  2.181979 2.265398 0.38883
H  3.533743 1.116767 0.557566
H  3.097863 1.731461 -1.047027
H  2.196723 -2.15447 1.247936
H  3.600632 -2.737674 0.30255
H  3.703464 -1.198553 1.204543
