program: Gaussian 09
title: 000244191
version: EM64L-G09RevD.01
frameworkgroup: C1[X(C12H19N)]
method: RPBEPBE
basis: SDD
operation: Freq
keyword: #pfreq=noraman
keyword: PBEPBE/SDD
title: #p freq=noraman PBEPBE/SDD
converged: YES YES NO NO
title: Mulliken charges:
elementType: N C C C C C C C C C C C C H H H H H H H H H H H H H H H H H H H
charge: -0.106663 0.251654 -0.616099 0.167079 -0.058992 -0.725358 -0.740782 0.214071 0.388197 -0.798615 -0.801739 -0.803384 -0.686483 0.223720 0.228581 0.225383 0.206054 0.232080 0.227646 0.202621 0.221791 0.230279 0.225069 0.248024 0.221463 0.219734 0.261761 0.225181 0.209123 0.264208 0.219365 0.225030
chargesum: 0.00000
title: Mulliken charges with hydrogens summed into heavy atoms:
elementType: N C C C C C C C C C C C C
charge: -0.106663 0.251654 -0.163798 0.167079 -0.058992 -0.061840 -0.088724 0.214071 0.388197 -0.095241 -0.098781 -0.104872 -0.242088
polarizability: 1.77280790e+02 7.81237285e+00 1.43914807e+02 5.98568799e+00 -9.69235796e-01 1.03586680e+02
1716.lowfreq: -9.1686 -0.0004 0.0005 0.0008 4.5267 16.9421 46.7564 71.6577 92.3311
frequency: 46.6949 71.6272 92.3143 106.4722 119.8882 149.5090 160.7311 183.2755 205.5570 210.4233 238.1845 254.7264 295.3329 302.3410 321.3829 338.9595 373.8881 403.7722 430.4805 470.8772 506.8821 535.5827 563.1884 595.0874 655.0023 696.2913 756.4258 798.7098 867.5839 886.8837 915.6338 925.6574 936.0025 942.5132 954.4735 961.4096 967.5290 996.0149 1006.0663 1028.2559 1052.2761 1075.4934 1100.0472 1129.5268 1150.2556 1176.6160 1222.7639 1244.7237 1255.7922 1282.6556 1353.7618 1368.9979 1385.9933 1387.0816 1390.5825 1397.9742 1418.3681 1447.5510 1450.2561 1456.0927 1461.1333 1462.7125 1464.8831 1469.7110 1471.1065 1474.1585 1480.5547 1482.3519 1501.4951 1645.9451 1670.1961 2958.6783 2963.2983 2972.1540 2976.3777 2980.6983 2981.6885 3025.3232 3033.5419 3065.3728 3066.4297 3073.5486 3078.2157 3084.8812 3088.9580 3097.6910 3098.9493 3099.0317 3128.2016 3202.9951
redmass: 2.6965 2.7317 2.3333 1.8606 1.5955 1.1537 1.3492 2.0766 1.4988 1.3200 1.5647 1.5131 2.6210 2.7891 2.7518 2.5406 2.4520 2.3595 2.7912 2.6027 3.3542 3.1548 3.0679 3.0465 2.0695 3.3238 1.8974 4.7567 2.8992 3.0029 1.9971 2.2518 1.3832 1.3279 1.4173 1.4455 1.4771 1.5072 1.4089 2.1035 1.5049 1.6539 1.3962 1.8903 2.9388 2.7722 2.3847 2.1586 4.4290 1.8746 4.5331 1.2127 1.2209 1.2205 1.2857 1.2058 1.2652 1.0492 1.0635 1.0604 1.0693 1.0612 1.0532 1.0743 1.0660 1.1027 1.0599 1.0573 5.7698 4.9328 7.3607 1.0408 1.0409 1.0642 1.0346 1.0376 1.0371 1.0960 1.0944 1.0950 1.0966 1.1001 1.0995 1.0999 1.0993 1.0717 1.0907 1.0963 1.0944 1.1144
irintensity: 0.1381 0.2779 1.6863 0.6052 0.8172 0.7754 0.4779 1.2499 0.5249 0.2076 0.4165 0.4097 0.3091 2.3760 0.0716 3.5108 1.2605 3.0694 1.6388 5.5002 1.6043 0.6126 2.8181 2.3403 3.8619 1.3482 10.3345 2.0127 4.0165 1.7215 0.3926 1.4784 3.6133 52.8836 1.7874 8.2416 1.0336 2.8879 0.4629 10.1523 4.2025 2.0044 4.7410 22.2975 35.5322 10.7309 8.3753 10.4044 14.1450 39.8171 17.2303 22.3187 24.2062 16.2192 19.0617 14.4402 3.8753 17.5835 5.5481 14.0916 14.3304 8.9656 3.0303 6.6677 4.2360 12.0125 12.7488 13.3430 56.4351 11.3042 19.5302 13.2759 71.8668 22.7680 25.9158 48.3925 20.4646 17.6771 29.4222 17.0436 14.5009 15.2019 49.7976 18.4918 45.2168 17.2204 9.2940 24.8481 11.5955 18.9936
temp: 298.150 k
press: 1.00000 atm
elementType: 7 6 6 6 6 6 6 6 6 6 6 6 6 1 1 1 1 1 1 1 1 1 1 1 1 1 1 1 1 1 1 1
symmnumber: 1
zpe: 727202.3 jmol-1
zpe.correction: 0.276977 hartree
zpe.thermalcorrener: 0.292377 hartree
zpe.thermalcorrenthalpy: 0.293321 hartree
zpe.thermalcorrgfe: 0.235556 hartree
zpe.sumelectzpe: -522.379761 hartree
zpe.sumelectthermal: -522.364360 hartree
zpe.sumelectthermalent: -522.363416 hartree
zpe.sumelectthermalfe: -522.421182 hartree
dipole: -1.1132 -2.1224 0.1506
dipole: 2.4014
quadrupole: -77.0977 -78.2364 -81.3360
quadrupole: -2.3989 0.0097 0.6563
quadrupole: 1.7923 0.6536 -2.4459 -2.3989 0.0097 0.6563
hfenergy: -522.6567376 hartree
pointgroup: C01 [X(C12H19N1)]
dipole: 0.3392363 0.8780181 0.0813379 debye
polarizability: 174.8232043|11.6633073|146.1124976|-6.8402914|1.4110258|103.8465752 unknown
InChI: InChI=1S/C12H19N/c1-8(2)10-7-12(5,6)13-11(10)9(3)4/h3,7H2,1-2,4-6H3
charge 0 multiplicity 1
32 atoms
N  -0.979741 -1.1691 0.001277
C  -1.991175 -0.04585 -0.018979
C  -1.196082 1.199712 -0.547036
C  0.259601 0.837336 -0.230867
C  0.241062 -0.661905 -0.126814
C  -2.481815 0.169974 1.435845
C  -3.160001 -0.452628 -0.935896
C  1.250699 1.742257 0.059504
C  1.385218 -1.612975 -0.264337
C  1.015612 3.238883 -0.096721
C  2.621673 1.409539 0.62336
C  1.23305 -2.954143 0.428243
C  2.448044 -1.323047 -1.067789
H  -1.527306 2.134221 -0.06474
H  -1.351434 1.305099 -1.640252
H  -1.656834 0.528788 2.078057
H  -3.300849 0.912242 1.464809
H  -2.854867 -0.781572 1.854015
H  -3.665483 -1.351263 -0.540486
H  -3.900673 0.365799 -1.008068
H  -2.795755 -0.686121 -1.952446
H  0.857401 3.719149 0.890909
H  1.909157 3.720439 -0.539343
H  0.14983 3.476321 -0.734863
H  3.422061 1.602312 -0.119452
H  2.830537 2.074133 1.485434
H  2.714303 0.366132 0.953768
H  1.183628 -2.826283 1.526427
H  2.071524 -3.629575 0.187059
H  0.280052 -3.42379 0.128205
H  3.250625 -2.051499 -1.2306
H  2.528836 -0.366887 -1.595327
