program: Gaussian 09
title: 000244185
version: EM64L-G09RevD.01
frameworkgroup: C1[X(C9H16O)]
method: RPBEPBE
basis: SDD
operation: Freq
keyword: #pfreq=noraman
keyword: PBEPBE/SDD
title: #p freq=noraman PBEPBE/SDD
converged: YES YES NO NO
title: Mulliken charges:
elementType: O C C C C C C C C C H H H H H H H H H H H H H H H H
charge: -0.463799 -0.084337 -0.460149 -0.461698 0.316322 -0.461542 -0.259393 -0.233341 -0.753223 -0.730991 0.215357 0.228100 0.187957 0.234728 0.212104 0.211583 0.209705 0.231328 0.224872 0.242967 0.214647 0.202075 0.211435 0.200788 0.237494 0.327012
chargesum: 0.00000
title: Mulliken charges with hydrogens summed into heavy atoms:
elementType: O C C C C C C C C C
charge: -0.136786 0.131020 -0.044092 -0.014866 0.316322 -0.040255 -0.028065 -0.008469 -0.093534 -0.081275
polarizability: 1.21097282e+02 -4.54823666e+00 9.40327959e+01 3.73688789e+00 -6.89996847e-02 7.77546471e+01
1716.lowfreq: -25.3415 -9.1993 0.0005 0.0006 0.0008 8.9063 34.2779 80.5246 104.1243
frequency: 29.9677 80.4295 104.0723 156.5334 220.5675 243.9636 265.7580 280.1806 309.1757 324.8410 347.3904 386.0320 423.0852 490.8120 497.6069 618.9382 718.0787 749.0178 763.2746 796.1208 840.1453 869.2423 903.5067 908.4379 921.0626 942.3325 949.8324 986.8271 995.7580 1021.9960 1051.1995 1083.1017 1097.9297 1122.0161 1132.3802 1172.5215 1176.8669 1192.6957 1250.3410 1258.1138 1278.7166 1284.5893 1311.9500 1323.6724 1342.7227 1355.4317 1374.7768 1392.6497 1440.1429 1460.0395 1461.1350 1462.0122 1473.0748 1474.4406 1485.2877 1630.9307 2932.7455 2960.5184 2968.2372 2969.8500 2976.8427 3014.4208 3028.2746 3033.4232 3058.0458 3066.2090 3085.4370 3087.8652 3093.5450 3119.2929 3158.7516 3537.4474
redmass: 3.1058 2.4214 2.8591 2.6331 1.0658 1.2936 3.4891 1.9488 1.2142 2.1739 1.9635 2.2187 2.6351 2.1767 2.4644 2.3847 1.6855 2.6475 4.9362 1.7856 2.1265 2.5622 1.9113 1.5391 2.3467 1.4803 1.4627 1.4138 1.9478 1.9175 1.8668 1.4062 1.2757 1.7108 1.3809 2.2553 1.7892 1.3223 1.5378 1.4243 1.3068 1.5019 1.4668 1.4582 1.6861 1.8544 1.2269 1.2174 1.0819 1.0696 1.0684 1.0558 1.0925 1.0651 1.0651 6.3913 1.0815 1.0644 1.0501 1.0439 1.0401 1.0870 1.0726 1.0995 1.0982 1.0973 1.0998 1.1030 1.0985 1.0859 1.1060 1.0657
irintensity: 1.0331 0.4379 1.3752 0.3492 0.7711 2.0089 1.5267 2.5858 73.1215 51.4896 5.8130 4.6620 5.7386 11.4701 6.6119 9.4604 31.9359 34.3137 2.6636 1.9508 4.0811 14.9527 1.6068 1.5362 11.3729 1.8944 0.2751 1.2219 3.0832 2.7740 12.2420 6.6600 37.7090 10.8709 34.9375 27.7719 9.6846 1.9558 5.2115 2.8256 2.5893 4.3373 2.5472 20.8277 0.5224 26.4688 29.3435 16.4282 3.4250 4.2441 4.7007 4.4053 6.3583 6.5990 22.1023 2.6471 32.0349 62.0905 15.1038 39.2399 32.2134 19.4934 31.8182 30.1475 3.5015 79.7750 18.0214 49.7457 34.4220 8.7990 37.6693 6.3273
temp: 298.150 k
press: 1.00000 atm
elementType: 8 6 6 6 6 6 6 6 6 6 1 1 1 1 1 1 1 1 1 1 1 1 1 1 1 1
symmnumber: 1
zpe: 600074.6 jmol-1
zpe.correction: 0.228556 hartree
zpe.thermalcorrener: 0.239897 hartree
zpe.thermalcorrenthalpy: 0.240841 hartree
zpe.thermalcorrgfe: 0.191562 hartree
zpe.sumelectzpe: -426.944631 hartree
zpe.sumelectthermal: -426.933291 hartree
zpe.sumelectthermalent: -426.932347 hartree
zpe.sumelectthermalfe: -426.981626 hartree
dipole: 1.8236 -0.4285 0.8565
dipole: 2.0598
quadrupole: -56.4679 -61.1571 -64.4318
quadrupole: 0.8585 1.1832 0.9187
quadrupole: 4.2177 -0.4715 -3.7462 0.8585 1.1832 0.9187
hfenergy: -427.1731875 hartree
pointgroup: C01 [X(C9H16O1)]
dipole: -0.7200331 -0.2157602 -0.3028789 debye
dipolederiv: -0.2818189 -0.0843593 0.1211282 -0.0952033 -0.7608647 -0.0690528 0.1486995 -0.0782774 -0.587314 0.0131341 0.0130398 -0.005544 0.0551216 0.0111022 0.0310187 -0.0603511 0.0318094 0.2174235 0.0098059 0.0424552 0.0048826 0.0329676 0.0872911 0.0130835 -0.0449436 0.0318481 0.0541045 -0.0029714 -0.0662551 0.0184362 -0.0417661 -0.0008182 -0.0341842 -0.0053904 0.0029117 0.0988014 0.38708 0.0312426 -0.0384141 -0.0077391 0.6078998 0.0472911 -0.009395 0.0514746 0.4665402 -0.0276632 0.0403221 -0.0240245 0.0072867 -0.0097339 0.0422781 -0.0051364 0.068187 0.2274142 0.0405311 -0.0711562 0.0838251 -0.113269 0.0082322 -0.0297741 0.2021009 -0.0333674 -0.2218595 -0.0460035 0.0065206 0.0456604 0.0348748 0.1456991 -0.0630534 -0.0163703 -0.0890172 -0.2455542 0.0006399 -0.0320087 -0.0171385 0.0177783 -0.0035794 0.038453 -0.0389503 -0.0389561 -0.216225 -0.1222958 -0.1060639 0.0958664 -0.0018134 -0.0012732 0.0103174 0.0821088 0.047799 -0.0565448 0.0030374 -0.0335982 -0.0551536 0.0013533 0.0263028 -0.0262625 -0.0776629 -0.0467934 -0.1746395 0.0322485 0.0068081 -0.0445487 -0.0030148 0.0741838 -0.0525305 -0.0138077 -0.0171004 -0.1415603 0.0181157 -0.0528266 0.0050766 -0.0645356 -0.1726131 0.0050432 0.0065603 -0.0281897 0.0730832 0.0567218 0.0297629 0.0523463 0.022663 0.0522202 -0.0331993 0.0726232 -0.0777855 -0.088654 0.0364299 0.0699867 -0.0582898 0.0628019 -0.0459597 0.0958237 -0.0627937 0.119716 -0.0278937 0.0007462 -0.0603113 -0.0666196 -0.0992985 -0.0525283 -0.0877916 -0.108966 -0.1284952 -0.0234669 0.0013417 -0.0119927 0.0825403 -0.0574866 0.0091084 0.0536573 0.1518172 0.1006395 -0.1163116 0.0697824 -0.0243726 -0.0178502 0.0142413 -0.1447779 0.0356996 -0.0365373 0.0353707 0.1572572 -0.1114896 0.0937973 -0.0530313 0.0929153 0.0180832 0.0382711 -0.0651606 0.0381416 0.160058 -0.0024297 -0.0812192 0.1160534 -0.0941215 0.0369862 0.0569255 0.108068 0.0432338 -0.0002234 0.1124331 0.0123173 0.0032486 -0.007238 -0.1368834 -0.0892698 -0.0010288 -0.0497782 0.0533585 -0.1728272 0.0945819 -0.0881801 0.1130605 0.0465001 0.0293733 -0.0229495 -0.0046113 0.0644208 0.0851261 -0.0172186 0.007992 -0.0629593 -0.1519533 -0.0346724 -0.0037326 -0.0634008 0.0783043 -0.157878 0.0790011 -0.016001 0.1388905 0.0064123 0.0343546 -0.0585337 0.0542972 0.0686889 0.0864829 -0.0099366 -0.0628325 -0.0105344 0.0904584 -0.0203431 -0.0094426 -0.0003585 -0.1494735 -0.0282795 0.1314837 -0.0894282 0.0650248 0.2605053 0.0085438 -0.1308253 0.0307027 0.3302658 unknown
polarizability: 121.0857109|5.2025944|93.8955898|2.5246639|-1.9821846|77.903424 unknown
InChI: InChI=1S/C9H16O/c1-9(2,10)7-8-5-3-4-6-8/h3,5,8,10H,4,6-7H2,1-2H3
charge 0 multiplicity 1
26 atoms
O  -1.735647 1.44806 0.417371
C  0.669374 -0.343733 -0.327858
C  -0.608595 -0.692241 0.476907
C  1.230523 1.102036 -0.103863
C  -1.926362 0.010348 0.062653
C  2.787819 0.969263 -0.089959
C  1.858948 -1.222773 0.056952
C  3.009055 -0.512287 0.186897
C  -2.225709 -0.103457 -1.44951
C  -3.10228 -0.552883 0.895613
H  0.454542 -0.506284 -1.407404
H  -0.428751 -0.464735 1.545872
H  -0.785397 -1.785568 0.40566
H  0.870975 1.473202 0.87156
H  0.867705 1.814453 -0.8631
H  3.258554 1.621185 0.67077
H  3.236915 1.250461 -1.065902
H  1.770284 -2.310101 0.171809
H  3.991044 -0.937268 0.423327
H  -1.470972 0.443416 -2.03943
H  -2.231656 -1.158509 -1.780407
H  -3.218469 0.328259 -1.682682
H  -3.274211 -1.62316 0.677784
H  -4.041289 -0.009984 0.670652
H  -2.891167 -0.444318 1.974163
H  -2.580029 1.929516 0.218226
